BDBM2329 6-[1-(naphthalen-1-yl)propyl]-2-(propan-2-ylsulfanyl)-3,4-dihydropyrimidin-4-one::S-DABO::thio-DABO 3ee
SMILES: CCC(c1cc(=O)[nH]c(SC(C)C)n1)c1cccc2ccccc12
InChI Key: InChIKey=IZKGIUQGNNDGJJ-UHFFFAOYSA-N
Data: 1 IC50
Activity Spreadsheet -- Enzyme Inhibition Constant Data from BindingDB
Found 1 hit for monomerid = 2329
Trg + Lig
Ki
nM
ΔG°
kcal/mole
IC50
nM
Kd
nM
EC50/IC50
nM
koff
s-1
kon
M-1s-1
pHTemp
°C
HIV-1 Reverse Transcriptase
(Human immunodeficiency virus type 1)
BDBM2329
(6-[1-(naphthalen-1-yl)propyl]-2-(propan-2-ylsulfan...)
Show SMILES CCC(c1cc(=O)[nH]c(SC(C)C)n1)c1cccc2ccccc12
Show InChI InChI=1S/C20H22N2OS/c1-4-15(17-11-7-9-14-8-5-6-10-16(14)17)18-12-19(23)22-20(21-18)24-13(2)3/h5-13,15H,4H2,1-3H3,(H,21,22,23)
n/an/a 800n/an/an/an/a7.837
Universita degli Studi di Roma La Sapienza
Assay Description
The IC50 of reverse transcriptase is the concentration that inhibits 50% of recombinant HIV-1 RT RNA-directed DNA polymerase activity in vitro.
J Med Chem 44: 2544-54 (2001)
Article DOI: 10.1021/jm010853h
BindingDB Entry DOI: 10.7270/Q2CN724V