BDBM233058 mtFabH inhibitor, 8
SMILES: CC1=C(O)C(C)(SC1=O)C#Cc1ccccc1C#N
InChI Key: InChIKey=MZLGLPSNNKKYEJ-UHFFFAOYSA-N
Data: 1 IC50
Activity Spreadsheet -- Enzyme Inhibition Constant Data from BindingDB
Found 1 hit for monomerid = 233058
Trg + Lig
Ki
nM
ΔG°
kcal/mole
IC50
nM
Kd
nM
EC50/IC50
nM
koff
s-1
kon
M-1s-1
pHTemp
°C
β-Ketoacyl-acyl carrier protein (ACP) synthase III (FabH)
(Mycobacterium tuberculosis)
BDBM233058
(mtFabH inhibitor, 8)
Show SMILES CC1=C(O)C(C)(SC1=O)C#Cc1ccccc1C#N |c:1|
Show InChI InChI=1S/C15H11NO2S/c1-10-13(17)15(2,19-14(10)18)8-7-11-5-3-4-6-12(11)9-16/h3-6,17H,1-2H3
n/an/a 4.80E+4n/an/an/an/an/an/a
China Pharmaceutical University
Assay Description
The biological activities of the compounds were evaluated in the same laboratory. Biological activities measured as IC50 were converted to pIC50 (...
J Enzyme Inhib Med Chem 25: 240-9 (2010)
Article DOI: 10.3109/14756360903049059
BindingDB Entry DOI: 10.7270/Q22R3QJT