BDBM233237 US9346786, 41
SMILES: CCN([C@@H]1CN(C[C@H]1c1ccc(Cl)c(F)c1)C(=O)C1CCN(CC1)c1ccc(Cl)cn1)C(=O)Oc1ccc(F)cc1
InChI Key: InChIKey=ZZRZEADTRZZNAZ-RPLLCQBOSA-N
Data: 1 KI
Activity Spreadsheet -- Enzyme Inhibition Constant Data from BindingDB
Found 1 hit for monomerid = 233237
Trg + Lig
Ki
nM
ΔG°
kcal/mole
IC50
nM
Kd
nM
EC50/IC50
nM
koff
s-1
kon
M-1s-1
pHTemp
°C
Neuromedin-K receptor
(Homo sapiens (Human))
BDBM233237
(US9346786, 41)
Show SMILES CCN([C@@H]1CN(C[C@H]1c1ccc(Cl)c(F)c1)C(=O)C1CCN(CC1)c1ccc(Cl)cn1)C(=O)Oc1ccc(F)cc1 |r|
Show InChI InChI=1S/C30H30Cl2F2N4O3/c1-2-38(30(40)41-23-7-5-22(33)6-8-23)27-18-37(17-24(27)20-3-9-25(32)26(34)15-20)29(39)19-11-13-36(14-12-19)28-10-4-21(31)16-35-28/h3-10,15-16,19,24,27H,2,11-14,17-18H2,1H3/t24-,27+/m0/s1
Reactome pathway
US Patent
0.600 -11.7n/an/an/an/an/a7.44
Hoffmann-La Roche Inc.
US Patent
Assay Description
hNK3 receptor binding experiment were performed using [3H]SR142801 (Catalog No. TRK1035, specific activity: 74.0 Ci/mmol, Amersham, GE Healthcare UK ...
US Patent US9346786 (2016)
BindingDB Entry DOI: 10.7270/Q20V8BPC