BDBM233247 US9346786, 51
SMILES: CCN([C@@H]1CN(C[C@H]1c1ccc(F)c(F)c1)C(=O)C1CCN(CC1)c1ccc(nc1)C#N)C(=O)Oc1ccc(F)cc1
InChI Key: InChIKey=ZUFFQLMAOYIRDR-LITSAYRRSA-N
Data: 1 KI
Activity Spreadsheet -- Enzyme Inhibition Constant Data from BindingDB
Found 1 hit for monomerid = 233247
Trg + Lig
Ki
nM
ΔG°
kcal/mole
IC50
nM
Kd
nM
EC50/IC50
nM
koff
s-1
kon
M-1s-1
pHTemp
°C
Neuromedin-K receptor
(Homo sapiens (Human))
BDBM233247
(US9346786, 51)
Show SMILES CCN([C@@H]1CN(C[C@H]1c1ccc(F)c(F)c1)C(=O)C1CCN(CC1)c1ccc(nc1)C#N)C(=O)Oc1ccc(F)cc1 |r|
Show InChI InChI=1S/C31H30F3N5O3/c1-2-39(31(41)42-25-8-4-22(32)5-9-25)29-19-38(18-26(29)21-3-10-27(33)28(34)15-21)30(40)20-11-13-37(14-12-20)24-7-6-23(16-35)36-17-24/h3-10,15,17,20,26,29H,2,11-14,18-19H2,1H3/t26-,29+/m0/s1
Reactome pathway
US Patent
2 -11.0n/an/an/an/an/a7.44
Hoffmann-La Roche Inc.
US Patent
Assay Description
hNK3 receptor binding experiment were performed using [3H]SR142801 (Catalog No. TRK1035, specific activity: 74.0 Ci/mmol, Amersham, GE Healthcare UK ...
US Patent US9346786 (2016)
BindingDB Entry DOI: 10.7270/Q20V8BPC