BDBM233264 US9346786, 68
SMILES: CCN([C@@H]1CN(C[C@H]1c1ccc(Cl)c(F)c1)C(=O)C1CCN(CC1)C(=O)C1(CCC1)C(F)(F)F)C(=O)Oc1ccc(F)cc1
InChI Key: InChIKey=QEPMPJKPSSBTJL-JYFHCDHNSA-N
Data: 1 KI
Activity Spreadsheet -- Enzyme Inhibition Constant Data from BindingDB
Found 1 hit for monomerid = 233264
Trg + Lig
Ki
nM
ΔG°
kcal/mole
IC50
nM
Kd
nM
EC50/IC50
nM
koff
s-1
kon
M-1s-1
pHTemp
°C
Neuromedin-K receptor
(Homo sapiens (Human))
BDBM233264
(US9346786, 68)
Show SMILES CCN([C@@H]1CN(C[C@H]1c1ccc(Cl)c(F)c1)C(=O)C1CCN(CC1)C(=O)C1(CCC1)C(F)(F)F)C(=O)Oc1ccc(F)cc1 |r|
Show InChI InChI=1S/C31H33ClF5N3O4/c1-2-40(29(43)44-22-7-5-21(33)6-8-22)26-18-39(17-23(26)20-4-9-24(32)25(34)16-20)27(41)19-10-14-38(15-11-19)28(42)30(12-3-13-30)31(35,36)37/h4-9,16,19,23,26H,2-3,10-15,17-18H2,1H3/t23-,26+/m0/s1
Reactome pathway
US Patent
2 -11.0n/an/an/an/an/a7.44
Hoffmann-La Roche Inc.
US Patent
Assay Description
hNK3 receptor binding experiment were performed using [3H]SR142801 (Catalog No. TRK1035, specific activity: 74.0 Ci/mmol, Amersham, GE Healthcare UK ...
US Patent US9346786 (2016)
BindingDB Entry DOI: 10.7270/Q20V8BPC