BDBM23327 3,3-dimethyl-1-[(2S)-2-(6-phenylhexanoyl)pyrrolidin-1-yl]pentane-1,2-dione::N-Glyoxylprolyl ketone, 5j
SMILES: CCC(C)(C)C(=O)C(=O)N1CCC[C@H]1C(=O)CCCCCc1ccccc1
InChI Key: InChIKey=FQHDUEOHSBYAEM-IBGZPJMESA-N
Data: 1 KI
Activity Spreadsheet -- Enzyme Inhibition Constant Data from BindingDB
Found 1 hit for monomerid = 23327
Trg + Lig
Ki
nM
ΔG°
kcal/mole
IC50
nM
Kd
nM
EC50/IC50
nM
koff
s-1
kon
M-1s-1
pHTemp
°C
Immunophilin FKBP12
(Bos taurus (bovine))
BDBM23327
(3,3-dimethyl-1-[(2S)-2-(6-phenylhexanoyl)pyrrolidi...)
Show SMILES CCC(C)(C)C(=O)C(=O)N1CCC[C@H]1C(=O)CCCCCc1ccccc1 |r|
Show InChI InChI=1S/C23H33NO3/c1-4-23(2,3)21(26)22(27)24-17-11-15-19(24)20(25)16-10-6-9-14-18-12-7-5-8-13-18/h5,7-8,12-13,19H,4,6,9-11,14-17H2,1-3H3/t19-/m0/s1
Reactome pathway
3.80E+3 -6.77n/an/an/an/an/a8.00
Guilford Pharmaceuticals, Inc.
Assay Description
PPIase(Rotamase) activity of FKBP12 was assayed using the peptide N-succinyl Ala-Leu-Pro-Phe p-nitroanilide as substrate. It is based on the observat...
J Med Chem 45: 3558-68 (2002)
Article DOI: 10.1021/jm0200456
BindingDB Entry DOI: 10.7270/Q2GH9G7G