null
SMILES: CCN([C@@H]1CN(C[C@H]1c1ccc(Cl)c(Cl)c1)C(=O)C1CCN(CC1)c1ccc(cn1)C(F)(F)F)C(=O)Oc1ccc(F)cc1
InChI Key: InChIKey=AYOVXTCZKHTEGV-RPLLCQBOSA-N
Activity Spreadsheet -- Enzyme Inhibition Constant Data from BindingDB
Found 1 hit for monomerid = 233310
Trg + Lig
Ki
nM
ΔG°
kcal/mole
IC50
nM
Kd
nM
EC50/IC50
nM
koff
s-1
kon
M-1s-1
pHTemp
°C
Neuromedin-K receptor
(Homo sapiens (Human))
BDBM233310
(US9346786, 114)
Show SMILES CCN([C@@H]1CN(C[C@H]1c1ccc(Cl)c(Cl)c1)C(=O)C1CCN(CC1)c1ccc(cn1)C(F)(F)F)C(=O)Oc1ccc(F)cc1 |r|
Show InChI InChI=1S/C31H30Cl2F4N4O3/c1-2-41(30(43)44-23-7-5-22(34)6-8-23)27-18-40(17-24(27)20-3-9-25(32)26(33)15-20)29(42)19-11-13-39(14-12-19)28-10-4-21(16-38-28)31(35,36)37/h3-10,15-16,19,24,27H,2,11-14,17-18H2,1H3/t24-,27+/m0/s1
Reactome pathway
US Patent
1.60 -11.1n/an/an/an/an/a7.44
Hoffmann-La Roche Inc.
US Patent
Assay Description
hNK3 receptor binding experiment were performed using [3H]SR142801 (Catalog No. TRK1035, specific activity: 74.0 Ci/mmol, Amersham, GE Healthcare UK ...
US Patent US9346786 (2016)
BindingDB Entry DOI: 10.7270/Q20V8BPC