BDBM233311 US9346786, 115
SMILES: CCN([C@@H]1CN(C[C@H]1c1ccc(Cl)c(Cl)c1)C(=O)C1CCN(CC1)c1ccc(cn1)C(N)=O)C(=O)Oc1ccc(F)cc1
InChI Key: InChIKey=SBSPWPKXBRUMKC-RPLLCQBOSA-N
Data: 1 KI
Activity Spreadsheet -- Enzyme Inhibition Constant Data from BindingDB
Found 1 hit for monomerid = 233311
Trg + Lig
Ki
nM
ΔG°
kcal/mole
IC50
nM
Kd
nM
EC50/IC50
nM
koff
s-1
kon
M-1s-1
pHTemp
°C
Neuromedin-K receptor
(Homo sapiens (Human))
BDBM233311
(US9346786, 115)
Show SMILES CCN([C@@H]1CN(C[C@H]1c1ccc(Cl)c(Cl)c1)C(=O)C1CCN(CC1)c1ccc(cn1)C(N)=O)C(=O)Oc1ccc(F)cc1 |r|
Show InChI InChI=1S/C31H32Cl2FN5O4/c1-2-39(31(42)43-23-7-5-22(34)6-8-23)27-18-38(17-24(27)20-3-9-25(32)26(33)15-20)30(41)19-11-13-37(14-12-19)28-10-4-21(16-36-28)29(35)40/h3-10,15-16,19,24,27H,2,11-14,17-18H2,1H3,(H2,35,40)/t24-,27+/m0/s1
Reactome pathway
US Patent
0.900 -11.5n/an/an/an/an/a7.44
Hoffmann-La Roche Inc.
US Patent
Assay Description
hNK3 receptor binding experiment were performed using [3H]SR142801 (Catalog No. TRK1035, specific activity: 74.0 Ci/mmol, Amersham, GE Healthcare UK ...
US Patent US9346786 (2016)
BindingDB Entry DOI: 10.7270/Q20V8BPC