BDBM23337 1-{7-methoxy-12-oxo-11,17-diazatetracyclo[11.3.1.0^{2,11}.0^{3,8}]heptadeca-3(8),4,6-trien-17-yl}-2-(3,4,5-trimethoxyphenyl)ethane-1,2-dione::Tetracyclic aza-amide, 5c
SMILES: COc1cccc2C3C4CCCC(N4C(=O)C(=O)c4cc(OC)c(OC)c(OC)c4)C(=O)N3CCc12
InChI Key: InChIKey=ZEVQFRBLECNYNE-UHFFFAOYSA-N
Data: 1 KI
Activity Spreadsheet -- Enzyme Inhibition Constant Data from BindingDB
Found 1 hit for monomerid = 23337
Trg + Lig
Ki
nM
ΔG°
kcal/mole
IC50
nM
Kd
nM
EC50/IC50
nM
koff
s-1
kon
M-1s-1
pHTemp
°C
Peptidyl-prolyl cis-trans isomerase FKBP1A
(Homo sapiens (Human))
BDBM23337
(1-{7-methoxy-12-oxo-11,17-diazatetracyclo[11.3.1.0...)
Show SMILES COc1cccc2C3C4CCCC(N4C(=O)C(=O)c4cc(OC)c(OC)c(OC)c4)C(=O)N3CCc12 |TLB:14:13:9.10.11:32.7.30|
Show InChI InChI=1S/C27H30N2O7/c1-33-20-10-5-7-17-16(20)11-12-28-23(17)18-8-6-9-19(26(28)31)29(18)27(32)24(30)15-13-21(34-2)25(36-4)22(14-15)35-3/h5,7,10,13-14,18-19,23H,6,8-9,11-12H2,1-4H3
NCI pathway
Reactome pathway
105 -9.19n/an/an/an/an/a8.015
Pfizer
Assay Description
PPIase(Rotamase) activity of FKBP12 was assayed using the peptide N-succinyl Ala-Leu-Pro-Phe p-nitroanilide as substrate. It is based on the observat...
J Med Chem 49: 1202-6 (2006)
Article DOI: 10.1021/jm049161u
BindingDB Entry DOI: 10.7270/Q2BR8QG9