BDBM234295 Met-PH (2)
SMILES: CSCCC(N)P(O)=O
InChI Key: InChIKey=CZRBNMUARBZMHQ-UHFFFAOYSA-N
Data: 1 KI
PDB links: 3 PDB IDs match this monomer.
Activity Spreadsheet -- Enzyme Inhibition Constant Data from BindingDB
Found 1 hit for monomerid = 234295
Trg + Lig
Ki
nM
ΔG°
kcal/mole
IC50
nM
Kd
nM
EC50/IC50
nM
koff
s-1
kon
M-1s-1
pHTemp
°C
Leucine aminopeptidase (LAP)
(Sus scrofa (Pig))
BDBM234295
(Met-PH (2))
Show SMILES CSCCC(N)P(O)=O
Show InChI InChI=1S/C4H12NO2PS/c1-9-3-2-4(5)8(6)7/h4,8H,2-3,5H2,1H3,(H,6,7)
2.20E+4 -6.35n/an/an/an/an/a8.425
Academy of Sciences of the Czech Republic
Assay Description
LAP was assayed in 75 mM triethanolamine hydrochloride buffer (pH = 8.4, containing 5 mM MgCl2) at 25°C. The substrate (L-leucine-p-nitroanilide) was...
J Enzyme Inhib Med Chem 26: 155-61 (2011)
Article DOI: 10.3109/14756366.2010.482047
BindingDB Entry DOI: 10.7270/Q22N515B