BDBM234673 US9353102, 3.2
SMILES: Cc1sc(NC(=O)C2=C(CCCC2)C(O)=O)c(c1C)-c1nc(no1)C1CC1
InChI Key: InChIKey=BKGWWAQQJDRZSV-UHFFFAOYSA-N
Data: 2 IC50
Activity Spreadsheet -- Enzyme Inhibition Constant Data from BindingDB
Found 2 hits for monomerid = 234673
Trg + Lig
Ki
nM
ΔG°
kcal/mole
IC50
nM
Kd
nM
EC50/IC50
nM
koff
s-1
kon
M-1s-1
pHTemp
°C
Fatty acid-binding protein 5
(Homo sapiens (Human))
BDBM234673
(US9353102, 3.2)
Show SMILES Cc1sc(NC(=O)C2=C(CCCC2)C(O)=O)c(c1C)-c1nc(no1)C1CC1 |t:7|
Show InChI InChI=1S/C19H21N3O4S/c1-9-10(2)27-18(14(9)17-20-15(22-26-17)11-7-8-11)21-16(23)12-5-3-4-6-13(12)19(24)25/h11H,3-8H2,1-2H3,(H,21,23)(H,24,25)
US Patent
n/an/a 90n/an/an/an/a7.5n/a
Hoffmann-La Roche Inc.
US Patent
Assay Description
Stock DMSO solutions (1.8 mM) of compounds were serially diluted 3-fold for ten concentrations with 100% DMSO (50 μM to 0.003 μM final comp...
US Patent US9353102 (2016)
BindingDB Entry DOI: 10.7270/Q23F4NH4
Fatty acid-binding protein, adipocyte
(Homo sapiens (Human))
BDBM234673
(US9353102, 3.2)
Show SMILES Cc1sc(NC(=O)C2=C(CCCC2)C(O)=O)c(c1C)-c1nc(no1)C1CC1 |t:7|
Show InChI InChI=1S/C19H21N3O4S/c1-9-10(2)27-18(14(9)17-20-15(22-26-17)11-7-8-11)21-16(23)12-5-3-4-6-13(12)19(24)25/h11H,3-8H2,1-2H3,(H,21,23)(H,24,25)
US Patent
n/an/a 20n/an/an/an/a7.5n/a
Hoffmann-La Roche Inc.
US Patent
Assay Description
Stock DMSO solutions (1.8 mM) of compounds were serially diluted 3-fold for ten concentrations with 100% DMSO (50 μM to 0.003 μM final comp...
US Patent US9353102 (2016)
BindingDB Entry DOI: 10.7270/Q23F4NH4