null
SMILES: COC(=O)[C@@]1(C[C@H]1C(=O)NO)c1cccc(Oc2ccc(C)cc2)c1
InChI Key: InChIKey=PDLMEJFFFHKMNV-LPHOPBHVSA-N
Activity Spreadsheet -- Enzyme Inhibition Constant Data from BindingDB
Found 1 hit for monomerid = 23473
Trg + Lig
Ki
nM
ΔG°
kcal/mole
IC50
nM
Kd
nM
EC50/IC50
nM
koff
s-1
kon
M-1s-1
pHTemp
°C
Disintegrin and metalloproteinase domain-containing protein 17 [215-477,S266A,N452Q]
(Homo sapiens (Human))
BDBM23473
(hydroxamate deriv., 65 | methyl (1R,2R)-2-(hydroxy...)
Show SMILES COC(=O)[C@@]1(C[C@H]1C(=O)NO)c1cccc(Oc2ccc(C)cc2)c1 |r|
Show InChI InChI=1S/C19H19NO5/c1-12-6-8-14(9-7-12)25-15-5-3-4-13(10-15)19(18(22)24-2)11-16(19)17(21)20-23/h3-10,16,23H,11H2,1-2H3,(H,20,21)/t16-,19-/m0/s1
140 -9.25n/an/an/an/an/a7.322
Schering-Plough Research Institute
Assay Description
Enzyme activity was determined by a kinetic assay measuring the rate of increase in fluorescent intensity generated by the cleavage of an internally ...
J Med Chem 51: 725-36 (2008)
Article DOI: 10.1021/jm070376o
BindingDB Entry DOI: 10.7270/Q2Q23XKR