BDBM23477 (1R,2R)-2-N-hydroxy-1-{3-[(2-methylquinolin-4-yl)methoxy]phenyl}-1-N-(propan-2-yl)cyclopropane-1,2-dicarboxamide::hydroxamate deriv., 69
SMILES: CC(C)NC(=O)[C@@]1(C[C@H]1C(=O)NO)c1cccc(OCc2cc(C)nc3ccccc23)c1
InChI Key: InChIKey=CWUUNJTYLPBTOO-OFVILXPXSA-N
Data: 1 KI
Activity Spreadsheet -- Enzyme Inhibition Constant Data from BindingDB
Found 1 hit for monomerid = 23477
Trg + Lig
Ki
nM
ΔG°
kcal/mole
IC50
nM
Kd
nM
EC50/IC50
nM
koff
s-1
kon
M-1s-1
pHTemp
°C
Disintegrin and metalloproteinase domain-containing protein 17 [215-477,S266A,N452Q]
(Homo sapiens (Human))
BDBM23477
((1R,2R)-2-N-hydroxy-1-{3-[(2-methylquinolin-4-yl)m...)
Show SMILES CC(C)NC(=O)[C@@]1(C[C@H]1C(=O)NO)c1cccc(OCc2cc(C)nc3ccccc23)c1 |r|
Show InChI InChI=1S/C25H27N3O4/c1-15(2)26-24(30)25(13-21(25)23(29)28-31)18-7-6-8-19(12-18)32-14-17-11-16(3)27-22-10-5-4-9-20(17)22/h4-12,15,21,31H,13-14H2,1-3H3,(H,26,30)(H,28,29)/t21-,25-/m0/s1
5 -11.2n/an/an/an/an/a7.322
Schering-Plough Research Institute
Assay Description
Enzyme activity was determined by a kinetic assay measuring the rate of increase in fluorescent intensity generated by the cleavage of an internally ...
J Med Chem 51: 725-36 (2008)
Article DOI: 10.1021/jm070376o
BindingDB Entry DOI: 10.7270/Q2Q23XKR