BDBM23502 beta-sulfonyl hydroxamate analogue, 7::tert-butyl 4-({[4-(but-2-yn-1-ylamino)benzene]sulfonyl}methyl)-4-(hydroxycarbamoyl)piperidine-1-carboxylate
SMILES: CC#CCNc1ccc(cc1)S(=O)(=O)CC1(CCN(CC1)C(=O)OC(C)(C)C)C(=O)NO
InChI Key: InChIKey=RXFCFGLSOUOCEA-UHFFFAOYSA-N
Data: 4 IC50
PDB links: 1 PDB ID matches this monomer.
Activity Spreadsheet -- Enzyme Inhibition Constant Data from BindingDB
Found 4 hits for monomerid = 23502
Trg + Lig
Ki
nM
ΔG°
kcal/mole
IC50
nM
Kd
nM
EC50/IC50
nM
koff
s-1
kon
M-1s-1
pHTemp
°C
Disintegrin and metalloproteinase domain-containing protein 17
(Homo sapiens (Human))
BDBM23502
(beta-sulfonyl hydroxamate analogue, 7 | tert-butyl...)
Show SMILES CC#CCNc1ccc(cc1)S(=O)(=O)CC1(CCN(CC1)C(=O)OC(C)(C)C)C(=O)NO
Show InChI InChI=1S/C22H31N3O6S/c1-5-6-13-23-17-7-9-18(10-8-17)32(29,30)16-22(19(26)24-28)11-14-25(15-12-22)20(27)31-21(2,3)4/h7-10,23,28H,11-16H2,1-4H3,(H,24,26)
Reactome pathway
n/an/a 1.60n/an/an/an/a7.422
Wyeth Research
Assay Description
Compounds were tested for their ability to inhibit the cleavage of the substrate by the purified enzyme in a fluorescence-based fluorescence resonanc...
Bioorg Med Chem 15: 6170-81 (2007)
Article DOI: 10.1016/j.bmc.2007.06.031
BindingDB Entry DOI: 10.7270/Q2FJ2F3N
Matrix metalloproteinase-14 (MMP14)
(Homo sapiens (Human))
BDBM23502
(beta-sulfonyl hydroxamate analogue, 7 | tert-butyl...)
Show SMILES CC#CCNc1ccc(cc1)S(=O)(=O)CC1(CCN(CC1)C(=O)OC(C)(C)C)C(=O)NO
Show InChI InChI=1S/C22H31N3O6S/c1-5-6-13-23-17-7-9-18(10-8-17)32(29,30)16-22(19(26)24-28)11-14-25(15-12-22)20(27)31-21(2,3)4/h7-10,23,28H,11-16H2,1-4H3,(H,24,26)
n/an/a 2.37E+3n/an/an/an/an/a25
Wyeth Research
Assay Description
A continuous assay was used in which the substrate is a synthetic peptide containing a fluorescent group (7-methoxycoumarin), which is quenched by en...
Bioorg Med Chem 15: 6170-81 (2007)
Article DOI: 10.1016/j.bmc.2007.06.031
BindingDB Entry DOI: 10.7270/Q2FJ2F3N
Collagenase 3
(Homo sapiens (Human))
BDBM23502
(beta-sulfonyl hydroxamate analogue, 7 | tert-butyl...)
Show SMILES CC#CCNc1ccc(cc1)S(=O)(=O)CC1(CCN(CC1)C(=O)OC(C)(C)C)C(=O)NO
Show InChI InChI=1S/C22H31N3O6S/c1-5-6-13-23-17-7-9-18(10-8-17)32(29,30)16-22(19(26)24-28)11-14-25(15-12-22)20(27)31-21(2,3)4/h7-10,23,28H,11-16H2,1-4H3,(H,24,26)
NCI pathway
Reactome pathway
n/an/a 860n/an/an/an/an/a25
Wyeth Research
Assay Description
A continuous assay was used in which the substrate is a synthetic peptide containing a fluorescent group (7-methoxycoumarin), which is quenched by en...
Bioorg Med Chem 15: 6170-81 (2007)
Article DOI: 10.1016/j.bmc.2007.06.031
BindingDB Entry DOI: 10.7270/Q2FJ2F3N
3D
3D Structure (crystal)
72 kDa type IV collagenase
(Homo sapiens (Human))
BDBM23502
(beta-sulfonyl hydroxamate analogue, 7 | tert-butyl...)
Show SMILES CC#CCNc1ccc(cc1)S(=O)(=O)CC1(CCN(CC1)C(=O)OC(C)(C)C)C(=O)NO
Show InChI InChI=1S/C22H31N3O6S/c1-5-6-13-23-17-7-9-18(10-8-17)32(29,30)16-22(19(26)24-28)11-14-25(15-12-22)20(27)31-21(2,3)4/h7-10,23,28H,11-16H2,1-4H3,(H,24,26)
Reactome pathway
n/an/a 120n/an/an/an/a7.422
Wyeth Research
Assay Description
A continuous assay was used in which the substrate is a synthetic peptide containing a fluorescent group (7-methoxycoumarin), which is quenched by en...
Bioorg Med Chem 15: 6170-81 (2007)
Article DOI: 10.1016/j.bmc.2007.06.031
BindingDB Entry DOI: 10.7270/Q2FJ2F3N