null
SMILES: CC(=C)[C@@H]1CC[C@@]2(CC[C@]3(C)[C@H](CC[C@@H]4[C@@]5(C)CC=C(c6ccc(cc6)C(O)=O)C(C)(C)[C@@H]5CC[C@@]34C)[C@@H]12)C#Cc1ccsc1-c1nnn[nH]1
InChI Key:
Activity Spreadsheet -- Enzyme Inhibition Constant Data from BindingDB
Found 1 hit for monomerid = 235035
Trg + Lig
Ki
nM
ΔG°
kcal/mole
IC50
nM
Kd
nM
EC50/IC50
nM
koff
s-1
kon
M-1s-1
pHTemp
°C
Envelope glycoprotein gp160
(Human immunodeficiency virus type 1 group M subtyp...)
BDBM235035
(4-((1R,3aS,5aR,5bR,7aR,11aS,11bR,13 aR,13bR)-3a-((...)
Show SMILES CC(=C)[C@@H]1CC[C@@]2(CC[C@]3(C)[C@H](CC[C@@H]4[C@@]5(C)CC=C(c6ccc(cc6)C(O)=O)C(C)(C)[C@@H]5CC[C@@]34C)[C@@H]12)C#Cc1ccsc1-c1nnn[nH]1 |r,t:18|
US Patent
n/an/an/an/a<100n/an/an/an/a
ViiV HEALTHCARE UK (NO.5) LIMITED
US Patent
Assay Description
MT-2 cells and 293T cells were obtained from the NIH AIDS Research and Reference Reagent Program. MT-2 cells were propagated in RPMI 1640 media suppl...
US Patent US10047118 (2018)
BindingDB Entry DOI: 10.7270/Q24J0H4C