BDBM23509 4-({[4-(but-2-yn-1-ylamino)benzene]sulfonyl}methyl)-N-hydroxy-1-[(2-methylphenyl)carbonyl]piperidine-4-carboxamide::beta-sulfonyl hydroxamate analogue, 20
SMILES: CC#CCNc1ccc(cc1)S(=O)(=O)CC1(CCN(CC1)C(=O)c1ccccc1C)C(=O)NO
InChI Key: InChIKey=IHSDOJRAORURAS-UHFFFAOYSA-N
Data: 4 IC50
Activity Spreadsheet -- Enzyme Inhibition Constant Data from BindingDB
Found 4 hits for monomerid = 23509
Trg + Lig
Ki
nM
ΔG°
kcal/mole
IC50
nM
Kd
nM
EC50/IC50
nM
koff
s-1
kon
M-1s-1
pHTemp
°C
Disintegrin and metalloproteinase domain-containing protein 17
(Homo sapiens (Human))
BDBM23509
(4-({[4-(but-2-yn-1-ylamino)benzene]sulfonyl}methyl...)
Show SMILES CC#CCNc1ccc(cc1)S(=O)(=O)CC1(CCN(CC1)C(=O)c1ccccc1C)C(=O)NO
Show InChI InChI=1S/C25H29N3O5S/c1-3-4-15-26-20-9-11-21(12-10-20)34(32,33)18-25(24(30)27-31)13-16-28(17-14-25)23(29)22-8-6-5-7-19(22)2/h5-12,26,31H,13-18H2,1-2H3,(H,27,30)
Reactome pathway
n/an/a 2.5n/an/an/an/a7.422
Wyeth Research
Assay Description
Compounds were tested for their ability to inhibit the cleavage of the substrate by the purified enzyme in a fluorescence-based fluorescence resonanc...
Bioorg Med Chem 15: 6170-81 (2007)
Article DOI: 10.1016/j.bmc.2007.06.031
BindingDB Entry DOI: 10.7270/Q2FJ2F3N
Matrix metalloproteinase-14 (MMP14)
(Homo sapiens (Human))
BDBM23509
(4-({[4-(but-2-yn-1-ylamino)benzene]sulfonyl}methyl...)
Show SMILES CC#CCNc1ccc(cc1)S(=O)(=O)CC1(CCN(CC1)C(=O)c1ccccc1C)C(=O)NO
Show InChI InChI=1S/C25H29N3O5S/c1-3-4-15-26-20-9-11-21(12-10-20)34(32,33)18-25(24(30)27-31)13-16-28(17-14-25)23(29)22-8-6-5-7-19(22)2/h5-12,26,31H,13-18H2,1-2H3,(H,27,30)
n/an/a 1.00E+3n/an/an/an/an/a25
Wyeth Research
Assay Description
A continuous assay was used in which the substrate is a synthetic peptide containing a fluorescent group (7-methoxycoumarin), which is quenched by en...
Bioorg Med Chem 15: 6170-81 (2007)
Article DOI: 10.1016/j.bmc.2007.06.031
BindingDB Entry DOI: 10.7270/Q2FJ2F3N
Collagenase 3
(Homo sapiens (Human))
BDBM23509
(4-({[4-(but-2-yn-1-ylamino)benzene]sulfonyl}methyl...)
Show SMILES CC#CCNc1ccc(cc1)S(=O)(=O)CC1(CCN(CC1)C(=O)c1ccccc1C)C(=O)NO
Show InChI InChI=1S/C25H29N3O5S/c1-3-4-15-26-20-9-11-21(12-10-20)34(32,33)18-25(24(30)27-31)13-16-28(17-14-25)23(29)22-8-6-5-7-19(22)2/h5-12,26,31H,13-18H2,1-2H3,(H,27,30)
NCI pathway
Reactome pathway
n/an/a 584n/an/an/an/an/a25
Wyeth Research
Assay Description
A continuous assay was used in which the substrate is a synthetic peptide containing a fluorescent group (7-methoxycoumarin), which is quenched by en...
Bioorg Med Chem 15: 6170-81 (2007)
Article DOI: 10.1016/j.bmc.2007.06.031
BindingDB Entry DOI: 10.7270/Q2FJ2F3N
72 kDa type IV collagenase
(Homo sapiens (Human))
BDBM23509
(4-({[4-(but-2-yn-1-ylamino)benzene]sulfonyl}methyl...)
Show SMILES CC#CCNc1ccc(cc1)S(=O)(=O)CC1(CCN(CC1)C(=O)c1ccccc1C)C(=O)NO
Show InChI InChI=1S/C25H29N3O5S/c1-3-4-15-26-20-9-11-21(12-10-20)34(32,33)18-25(24(30)27-31)13-16-28(17-14-25)23(29)22-8-6-5-7-19(22)2/h5-12,26,31H,13-18H2,1-2H3,(H,27,30)
Reactome pathway
n/an/a 46n/an/an/an/a7.422
Wyeth Research
Assay Description
A continuous assay was used in which the substrate is a synthetic peptide containing a fluorescent group (7-methoxycoumarin), which is quenched by en...
Bioorg Med Chem 15: 6170-81 (2007)
Article DOI: 10.1016/j.bmc.2007.06.031
BindingDB Entry DOI: 10.7270/Q2FJ2F3N