null
SMILES: CCC[C@@H](C(c1csc2c(cc(Cl)cc12)C#N)c1ccc(OC(F)(F)F)cc1)c1ccc(cc1)C(=O)NCCC(O)=O
InChI Key: InChIKey=VSKWUJDYLASLKH-RIBGEGAISA-N
Activity Spreadsheet -- Enzyme Inhibition Constant Data from BindingDB
Found 1 hit for monomerid = 235136
Trg + Lig
Ki
nM
ΔG°
kcal/mole
IC50
nM
Kd
nM
EC50/IC50
nM
koff
s-1
kon
M-1s-1
pHTemp
°C
Glucagon receptor
(Homo sapiens (Human))
BDBM235136
(US9359339, 25)
Show SMILES CCC[C@@H](C(c1csc2c(cc(Cl)cc12)C#N)c1ccc(OC(F)(F)F)cc1)c1ccc(cc1)C(=O)NCCC(O)=O
Show InChI InChI=1S/C31H26ClF3N2O4S/c1-2-3-24(18-4-6-20(7-5-18)30(40)37-13-12-27(38)39)28(19-8-10-23(11-9-19)41-31(33,34)35)26-17-42-29-21(16-36)14-22(32)15-25(26)29/h4-11,14-15,17,24,28H,2-3,12-13H2,1H3,(H,37,40)(H,38,39)/t24-,28?/m1/s1
US Patent
n/an/a 0.100n/an/an/an/a7.525
Merck Sharp & Dohme Corp.
US Patent
Assay Description
A stable CHO (Chinese hamster ovary) cell line expressing cloned human glucagon receptor was maintained as described (Chicchi, et. al. J Biol Chem 27...
US Patent US9359339 (2016)
BindingDB Entry DOI: 10.7270/Q2FQ9VHC