BDBM235250 US9365558, 73::US9822074, 73
SMILES: FC(F)(F)CCCCc1ccc(cc1)[C@@]1(CC(c2ccn(CC3CC3)n2)=C(C(=O)NS(=O)(=O)C2CC2)C(=O)N1)C(F)(F)F
InChI Key: InChIKey=QUIOVWTXEKVAQS-SANMLTNESA-N
Data: 2 IC50
Activity Spreadsheet -- Enzyme Inhibition Constant Data from BindingDB
Found 2 hits for monomerid = 235250
Trg + Lig
Ki
nM
ΔG°
kcal/mole
IC50
nM
Kd
nM
EC50/IC50
nM
koff
s-1
kon
M-1s-1
pHTemp
°C
Alpha-1,6-mannosyl-glycoprotein 2-beta-N-acetylglucosaminyltransferase
(Homo sapiens (Human))
BDBM235250
(US9365558, 73 | US9822074, 73)
Show SMILES FC(F)(F)CCCCc1ccc(cc1)[C@@]1(CC(c2ccn(CC3CC3)n2)=C(C(=O)NS(=O)(=O)C2CC2)C(=O)N1)C(F)(F)F |r,t:28|
Show InChI InChI=1S/C28H30F6N4O4S/c29-27(30,31)13-2-1-3-17-6-8-19(9-7-17)26(28(32,33)34)15-21(22-12-14-38(36-22)16-18-4-5-18)23(24(39)35-26)25(40)37-43(41,42)20-10-11-20/h6-9,12,14,18,20H,1-5,10-11,13,15-16H2,(H,35,39)(H,37,40)/t26-/m0/s1
US Patent
n/an/a 2n/an/an/an/an/an/a
Bristol-Myers Squibb Company
US Patent
Assay Description
The MGAT enzyme reactions were performed in Corning FALCONŽ 96-well Polypropylene plates, in a total volume of 60 μL of 50 mM Potassium Phosphat...
US Patent US9822074 (2017)
BindingDB Entry DOI: 10.7270/Q2K939TM
Alpha-1,6-mannosyl-glycoprotein 2-beta-N-acetylglucosaminyltransferase
(Homo sapiens (Human))
BDBM235250
(US9365558, 73 | US9822074, 73)
Show SMILES FC(F)(F)CCCCc1ccc(cc1)[C@@]1(CC(c2ccn(CC3CC3)n2)=C(C(=O)NS(=O)(=O)C2CC2)C(=O)N1)C(F)(F)F |r,t:28|
Show InChI InChI=1S/C28H30F6N4O4S/c29-27(30,31)13-2-1-3-17-6-8-19(9-7-17)26(28(32,33)34)15-21(22-12-14-38(36-22)16-18-4-5-18)23(24(39)35-26)25(40)37-43(41,42)20-10-11-20/h6-9,12,14,18,20H,1-5,10-11,13,15-16H2,(H,35,39)(H,37,40)/t26-/m0/s1
US Patent
n/an/a 2n/an/an/an/a7.465
Bristol-Myers Squibb Company
US Patent
Assay Description
The MGAT enzyme reactions were performed in Corning FALCON® 96-well Polypropylene plates, in a total volume of 60 μL of 50 mM Potassium Phosph...
US Patent US9365558 (2016)
BindingDB Entry DOI: 10.7270/Q2XS5T8B