BDBM23554 3-Carboxamide-coumarin deriv., 39::7-(diethylamino)-2-oxo-N-phenyl-2H-chromene-3-carboxamide
SMILES: CCN(CC)c1ccc2cc(C(=O)Nc3ccccc3)c(=O)oc2c1
InChI Key: InChIKey=ISMFAIDKRMYKSY-UHFFFAOYSA-N
Data: 1 Other
Activity Spreadsheet -- Enzyme Inhibition Constant Data from BindingDB
Found 1 hit for monomerid = 23554
Trg + Lig
Ki
nM
ΔG°
kcal/mole
IC50
nM
Kd
nM
EC50/IC50
nM
koff
s-1
kon
M-1s-1
pHTemp
°C
Factor XIIa
(Homo sapiens (Human))
BDBM23554
(3-Carboxamide-coumarin deriv., 39 | 7-(diethylamin...)
Show SMILES CCN(CC)c1ccc2cc(C(=O)Nc3ccccc3)c(=O)oc2c1
Show InChI InChI=1S/C20H20N2O3/c1-3-22(4-2)16-11-10-14-12-17(20(24)25-18(14)13-16)19(23)21-15-8-6-5-7-9-15/h5-13H,3-4H2,1-2H3,(H,21,23)
n/an/an/an/an/an/an/a7.922
University of Namur
Assay Description
After substrate hydrolysis reaction, the absorbance at 405 nm was measured in a microplate reader. Percentages of inhibition at each concentration we...
J Med Chem 51: 3077-80 (2008)
Article DOI: 10.1021/jm8002697
BindingDB Entry DOI: 10.7270/Q2610XNH