BDBM235735 US9359371, 3
SMILES: COc1ccc(CNc2nc(ncc2C(=O)NCc2ccccc2)N2CC3CC3C2)cc1Cl
InChI Key: InChIKey=QFAMNDUERIPOEM-UHFFFAOYSA-N
Data: 3 IC50
Activity Spreadsheet -- Enzyme Inhibition Constant Data from BindingDB
Found 3 hits for monomerid = 235735
Trg + Lig
Ki
nM
ΔG°
kcal/mole
IC50
nM
Kd
nM
EC50/IC50
nM
koff
s-1
kon
M-1s-1
pHTemp
°C
Phosphodiesterase 5A
(Homo sapiens (Human))
BDBM235735
(US9359371, 3)
Show SMILES COc1ccc(CNc2nc(ncc2C(=O)NCc2ccccc2)N2CC3CC3C2)cc1Cl
Show InChI InChI=1S/C25H26ClN5O2/c1-33-22-8-7-17(9-21(22)26)12-27-23-20(24(32)28-11-16-5-3-2-4-6-16)13-29-25(30-23)31-14-18-10-19(18)15-31/h2-9,13,18-19H,10-12,14-15H2,1H3,(H,28,32)(H,27,29,30)
US Patent
n/an/a 12.9n/an/an/an/a7.5n/a
XUANZHU PHARMA CO., LTD.
US Patent
Assay Description
To a 96-well plate, 20 μL, of 10 μM FL-cGMP as the substrate was added; then 1 μL, of solution of the compound in DMSO or DMSO solutio...
US Patent US9359371 (2016)
BindingDB Entry DOI: 10.7270/Q2BR8R2B
Phosphodiesterase 6
(Bos taurus (Bovine))
BDBM235735
(US9359371, 3)
Show SMILES COc1ccc(CNc2nc(ncc2C(=O)NCc2ccccc2)N2CC3CC3C2)cc1Cl
Show InChI InChI=1S/C25H26ClN5O2/c1-33-22-8-7-17(9-21(22)26)12-27-23-20(24(32)28-11-16-5-3-2-4-6-16)13-29-25(30-23)31-14-18-10-19(18)15-31/h2-9,13,18-19H,10-12,14-15H2,1H3,(H,28,32)(H,27,29,30)
US Patent
n/an/a 8.89n/an/an/an/a7.5n/a
XUANZHU PHARMA CO., LTD.
US Patent
Assay Description
Method: The test compound or solvent was incubated at 25° C. for 15 min with enzyme solution (0.2 μg/mL) in Tris-HCl buffer of pH 7.5. 100 μ...
US Patent US9359371 (2016)
BindingDB Entry DOI: 10.7270/Q2BR8R2B
Phosphodiesterase 5A
(Homo sapiens (Human))
BDBM235735
(US9359371, 3)
Show SMILES COc1ccc(CNc2nc(ncc2C(=O)NCc2ccccc2)N2CC3CC3C2)cc1Cl
Show InChI InChI=1S/C25H26ClN5O2/c1-33-22-8-7-17(9-21(22)26)12-27-23-20(24(32)28-11-16-5-3-2-4-6-16)13-29-25(30-23)31-14-18-10-19(18)15-31/h2-9,13,18-19H,10-12,14-15H2,1H3,(H,28,32)(H,27,29,30)
US Patent
n/an/a 0.910n/an/an/an/a7.5n/a
XUANZHU PHARMA CO., LTD.
US Patent
Assay Description
The test compound or solvent was incubated at 25° C. for 15 min with enzyme solution (35 μg/mL) in Tris-HCl buffer of pH 7.5. 1 μM cGMP and...
US Patent US9359371 (2016)
BindingDB Entry DOI: 10.7270/Q2BR8R2B