null
SMILES: C1Oc2cc3C[C@@H]4N(CCc5cc6OCOc6cc45)Cc3cc2O1
InChI Key: InChIKey=DEXCWVBNPJKCOQ-HNNXBMFYSA-N
Activity Spreadsheet -- Enzyme Inhibition Constant Data from BindingDB
Found 2 hits for monomerid = 235775
Trg + Lig
Ki
nM
ΔG°
kcal/mole
IC50
nM
Kd
nM
EC50/IC50
nM
koff
s-1
kon
M-1s-1
pHTemp
°C
D(1A) dopamine receptor
(Homo sapiens (Human))
BDBM235775
(US9359372, DC037012)
Show SMILES C1Oc2cc3C[C@@H]4N(CCc5cc6OCOc6cc45)Cc3cc2O1 |r|
Show InChI InChI=1S/C19H17NO4/c1-2-20-8-13-6-18-17(22-9-23-18)5-12(13)3-15(20)14-7-19-16(4-11(1)14)21-10-24-19/h4-7,15H,1-3,8-10H2/t15-/m0/s1
US Patent
148 -9.47 300n/an/an/an/an/a30
SHANGHAI INSTITUTE OF MATERIA MEDICA, CHINESE ACADEMY OF SCIENCES
US Patent
Assay Description
Different concentrations (10^−5 M-10^−11 M) of the compound of the invention and corresponding isotope receptor ligand as well as recepto...
US Patent US9359372 (2016)
BindingDB Entry DOI: 10.7270/Q2736PSP
D(2) dopamine receptor
(Homo sapiens (Human))
BDBM235775
(US9359372, DC037012)
Show SMILES C1Oc2cc3C[C@@H]4N(CCc5cc6OCOc6cc45)Cc3cc2O1 |r|
Show InChI InChI=1S/C19H17NO4/c1-2-20-8-13-6-18-17(22-9-23-18)5-12(13)3-15(20)14-7-19-16(4-11(1)14)21-10-24-19/h4-7,15H,1-3,8-10H2/t15-/m0/s1
Reactome pathway
US Patent
240 -9.18 1.24E+3n/an/an/an/an/a30
SHANGHAI INSTITUTE OF MATERIA MEDICA, CHINESE ACADEMY OF SCIENCES
US Patent
Assay Description
Different concentrations (10^−5 M-10^−11 M) of the compound of the invention and corresponding isotope receptor ligand as well as recepto...
US Patent US9359372 (2016)
BindingDB Entry DOI: 10.7270/Q2736PSP