BDBM236012 US9365562, 50
SMILES: Cc1nc(-c2ccccc2Cl)n(n1)-c1cc(nc(C)n1)N1CC(C1)c1nc2ccccc2n1C
InChI Key: InChIKey=PHBGAHMRTUHBJH-UHFFFAOYSA-N
Data: 1 KI
Activity Spreadsheet -- Enzyme Inhibition Constant Data from BindingDB
Found 1 hit for monomerid = 236012
Trg + Lig
Ki
nM
ΔG°
kcal/mole
IC50
nM
Kd
nM
EC50/IC50
nM
koff
s-1
kon
M-1s-1
pHTemp
°C
Phosphodiesterase 10A (PDE10A2)
(Homo sapiens (Human))
BDBM236012
(US9365562, 50)
Show SMILES Cc1nc(-c2ccccc2Cl)n(n1)-c1cc(nc(C)n1)N1CC(C1)c1nc2ccccc2n1C
Show InChI InChI=1S/C25H23ClN8/c1-15-27-22(33-13-17(14-33)24-30-20-10-6-7-11-21(20)32(24)3)12-23(28-15)34-25(29-16(2)31-34)18-8-4-5-9-19(18)26/h4-12,17H,13-14H2,1-3H3
US Patent
0.350 -12.9n/an/an/an/an/a7.225
Merck Sharp & Dohme Corp.
US Patent
Assay Description
The fluorescence polarization assay for cyclic nucleotide phosphodiesterases was performed using an IMAP® FP kit supplied by Molecular Devices, S...
US Patent US9365562 (2016)
BindingDB Entry DOI: 10.7270/Q2ST7NQZ