BDBM236032 US9365562, 70
SMILES: CC(C)Oc1nc(cc(n1)-n1nc(C)nc1C)N1CC(C1)c1nc2ccccc2n1C
InChI Key: InChIKey=YNUPOXUYOLBVIL-UHFFFAOYSA-N
Data: 1 KI
Activity Spreadsheet -- Enzyme Inhibition Constant Data from BindingDB
Found 1 hit for monomerid = 236032
Trg + Lig
Ki
nM
ΔG°
kcal/mole
IC50
nM
Kd
nM
EC50/IC50
nM
koff
s-1
kon
M-1s-1
pHTemp
°C
Phosphodiesterase 10A (PDE10A2)
(Homo sapiens (Human))
BDBM236032
(US9365562, 70)
Show SMILES CC(C)Oc1nc(cc(n1)-n1nc(C)nc1C)N1CC(C1)c1nc2ccccc2n1C
Show InChI InChI=1S/C22H26N8O/c1-13(2)31-22-25-19(10-20(26-22)30-15(4)23-14(3)27-30)29-11-16(12-29)21-24-17-8-6-7-9-18(17)28(21)5/h6-10,13,16H,11-12H2,1-5H3
US Patent
0.380 -12.8n/an/an/an/an/a7.225
Merck Sharp & Dohme Corp.
US Patent
Assay Description
The fluorescence polarization assay for cyclic nucleotide phosphodiesterases was performed using an IMAP® FP kit supplied by Molecular Devices, S...
US Patent US9365562 (2016)
BindingDB Entry DOI: 10.7270/Q2ST7NQZ