null
SMILES: Cc1nc(C)n(n1)-c1cc(nc(OCc2ccnn2C)n1)N1CC(C1)c1nc2ccccc2n1C
InChI Key: InChIKey=DJDHLSMOQPPTSV-UHFFFAOYSA-N
Activity Spreadsheet -- Enzyme Inhibition Constant Data from BindingDB
Found 1 hit for monomerid = 236035
Trg + Lig
Ki
nM
ΔG°
kcal/mole
IC50
nM
Kd
nM
EC50/IC50
nM
koff
s-1
kon
M-1s-1
pHTemp
°C
Isoform PDE10A2 of cAMP and cAMP-inhibited cGMP 3',5'-cyclic phosphodiesterase 10A (PDE10A2)
(Homo sapiens (Human))
BDBM236035
(US9365562, 73)
Show SMILES Cc1nc(C)n(n1)-c1cc(nc(OCc2ccnn2C)n1)N1CC(C1)c1nc2ccccc2n1C
Show InChI InChI=1S/C24H26N10O/c1-15-26-16(2)34(30-15)22-11-21(28-24(29-22)35-14-18-9-10-25-32(18)4)33-12-17(13-33)23-27-19-7-5-6-8-20(19)31(23)3/h5-11,17H,12-14H2,1-4H3
US Patent
0.130 -13.5n/an/an/an/an/a7.225
Merck Sharp & Dohme Corp.
US Patent
Assay Description
The fluorescence polarization assay for cyclic nucleotide phosphodiesterases was performed using an IMAP® FP kit supplied by Molecular Devices, S...
US Patent US9365562 (2016)
BindingDB Entry DOI: 10.7270/Q2ST7NQZ