BDBM23612 2-hydroxy-6-[(3-phenoxybenzene)amido]benzoic acid::3-Phenoxybenzoylamino deriv., 28f
SMILES: OC(=O)c1c(O)cccc1NC(=O)c1cccc(Oc2ccccc2)c1
InChI Key: InChIKey=QXBHJJXXAXXUEZ-UHFFFAOYSA-N
Data: 1 IC50
Activity Spreadsheet -- Enzyme Inhibition Constant Data from BindingDB
Found 1 hit for monomerid = 23612
Trg + Lig
Ki
nM
ΔG°
kcal/mole
IC50
nM
Kd
nM
EC50/IC50
nM
koff
s-1
kon
M-1s-1
pHTemp
°C
beta-Ketoacyl-ACP Synthase III (FabH)
(Enterococcus faecalis)
BDBM23612
(2-hydroxy-6-[(3-phenoxybenzene)amido]benzoic acid ...)
Show SMILES OC(=O)c1c(O)cccc1NC(=O)c1cccc(Oc2ccccc2)c1
Show InChI InChI=1S/C20H15NO5/c22-17-11-5-10-16(18(17)20(24)25)21-19(23)13-6-4-9-15(12-13)26-14-7-2-1-3-8-14/h1-12,22H,(H,21,23)(H,24,25)
n/an/a 410n/an/an/an/an/an/a
Quorex Pharmaceuticals Inc.
Assay Description
The potency of FabH inhibition (IC50) was determined using [3H]- or [14C]-radiolabeled substrates. This was accomplished at fixed concentrations of a...
J Med Chem 48: 1596-609 (2005)
Article DOI: 10.1021/jm049141s
BindingDB Entry DOI: 10.7270/Q22B8W9H