BDBM23613 2-[3-(Pyridin-4-yloxy)benzoylamino]benzoic acid::2-benzoylamino benzoic acid deriv., 28g::2-{[3-(pyridin-4-yloxy)benzene]amido}benzoic acid
SMILES: OC(=O)c1ccccc1NC(=O)c1cccc(Oc2ccncc2)c1
InChI Key: InChIKey=YATZGUOENCNURV-UHFFFAOYSA-N
Data: 1 IC50
Activity Spreadsheet -- Enzyme Inhibition Constant Data from BindingDB
Found 1 hit for monomerid = 23613
Trg + Lig
Ki
nM
ΔG°
kcal/mole
IC50
nM
Kd
nM
EC50/IC50
nM
koff
s-1
kon
M-1s-1
pHTemp
°C
beta-Ketoacyl-ACP Synthase III (FabH)
(Enterococcus faecalis)
BDBM23613
(2-[3-(Pyridin-4-yloxy)benzoylamino]benzoic acid | ...)
Show SMILES OC(=O)c1ccccc1NC(=O)c1cccc(Oc2ccncc2)c1
Show InChI InChI=1S/C19H14N2O4/c22-18(21-17-7-2-1-6-16(17)19(23)24)13-4-3-5-15(12-13)25-14-8-10-20-11-9-14/h1-12H,(H,21,22)(H,23,24)
n/an/a 1.00E+4n/an/an/an/an/an/a
Quorex Pharmaceuticals Inc.
Assay Description
The potency of FabH inhibition (IC50) was determined using [3H]- or [14C]-radiolabeled substrates. This was accomplished at fixed concentrations of a...
J Med Chem 48: 1596-609 (2005)
Article DOI: 10.1021/jm049141s
BindingDB Entry DOI: 10.7270/Q22B8W9H