BDBM236275 US9365576, 28
SMILES: COc1ccc(cc1-c1cc2C(=O)N(C(c2n1C(C)C)c1ccc(Cl)cc1)c1cc(Cl)ccc1C)C(=O)N1CCOCC1
InChI Key: InChIKey=NYQAJUIGTPVQJO-UHFFFAOYSA-N
Data: 1 IC50
Activity Spreadsheet -- Enzyme Inhibition Constant Data from BindingDB
Found 1 hit for monomerid = 236275
Trg + Lig
Ki
nM
ΔG°
kcal/mole
IC50
nM
Kd
nM
EC50/IC50
nM
koff
s-1
kon
M-1s-1
pHTemp
°C
p53-MDM2
(Homo sapiens (Human))
BDBM236275
(US9365576, 28)
Show SMILES COc1ccc(cc1-c1cc2C(=O)N(C(c2n1C(C)C)c1ccc(Cl)cc1)c1cc(Cl)ccc1C)C(=O)N1CCOCC1
Show InChI InChI=1S/C34H33Cl2N3O4/c1-20(2)38-29(26-17-23(8-12-30(26)42-4)33(40)37-13-15-43-16-14-37)19-27-32(38)31(22-6-10-24(35)11-7-22)39(34(27)41)28-18-25(36)9-5-21(28)3/h5-12,17-20,31H,13-16H2,1-4H3
Reactome pathway
US Patent
n/an/a 0.106n/an/an/an/an/a25
Novartis AG
US Patent
Assay Description
Assay 2: The test is performed in white 384-well plates (Greiner Bio-One, reference 781207) in a total volume of 60 μL by adding 1 μL of compou...
US Patent US9365576 (2016)
BindingDB Entry DOI: 10.7270/Q2DN43XR