BDBM236494 US9365853, 5
SMILES: C[C@H](NC(C)=O)C(=O)N[C@@H](CCCNC(N)=N)C(=O)c1nc2ccccc2s1
InChI Key: InChIKey=NANYGIYNANIGSH-GWCFXTLKSA-N
Data: 1 KI
Activity Spreadsheet -- Enzyme Inhibition Constant Data from BindingDB
Found 1 hit for monomerid = 236494
Trg + Lig
Ki
nM
ΔG°
kcal/mole
IC50
nM
Kd
nM
EC50/IC50
nM
koff
s-1
kon
M-1s-1
pHTemp
°C
Matriptase
(Homo sapiens (Human))
BDBM236494
(US9365853, 5)
Show SMILES C[C@H](NC(C)=O)C(=O)N[C@@H](CCCNC(N)=N)C(=O)c1nc2ccccc2s1 |r|
Show InChI InChI=1S/C18H24N6O3S/c1-10(22-11(2)25)16(27)23-13(7-5-9-21-18(19)20)15(26)17-24-12-6-3-4-8-14(12)28-17/h3-4,6,8,10,13H,5,7,9H2,1-2H3,(H,22,25)(H,23,27)(H4,19,20,21)/t10-,13-/m0/s1
US Patent
1.40 -12.1n/an/an/an/an/a7.425
TBA
US Patent
Assay Description
Enzymatic assays were performed in the following reaction buffer: 50 mM HEPES, pH 7.4 containing 500 μg/ml bovine serum albumin. Enzyme activiti...
US Patent US9365853 (2016)
BindingDB Entry DOI: 10.7270/Q28W3C6F