BDBM236598 US9365589, 1y
SMILES: CC1(C)C(=N)N[C@]2(COC[C@H]2S1(=O)=O)c1cc(NC(=O)c2ccc(OCC#C)cn2)ccc1F
InChI Key: InChIKey=ZKRIRTXSSDEWSN-AUSIDOKSSA-N
Data: 2 KI
Activity Spreadsheet -- Enzyme Inhibition Constant Data from BindingDB
Found 2 hits for monomerid = 236598
Trg + Lig
Ki
nM
ΔG°
kcal/mole
IC50
nM
Kd
nM
EC50/IC50
nM
koff
s-1
kon
M-1s-1
pHTemp
°C
Beta-secretase 1
(Homo sapiens (Human))
BDBM236598
(US9365589, 1y)
Show SMILES CC1(C)C(=N)N[C@]2(COC[C@H]2S1(=O)=O)c1cc(NC(=O)c2ccc(OCC#C)cn2)ccc1F |r|
Show InChI InChI=1S/C23H23FN4O5S/c1-4-9-33-15-6-8-18(26-11-15)20(29)27-14-5-7-17(24)16(10-14)23-13-32-12-19(23)34(30,31)22(2,3)21(25)28-23/h1,5-8,10-11,19H,9,12-13H2,2-3H3,(H2,25,28)(H,27,29)/t19-,23-/m1/s1
US Patent
1 -12.5n/an/an/an/an/a5.030
Merck Sharp & Dohme Corp.
US Patent
Assay Description
This assay monitors the increase of 620 nm fluorescence that resulted from BACE1 cleavage of an APPswedish APPswe mutant peptide FRET substrate (QSY7...
US Patent US9365589 (2016)
BindingDB Entry DOI: 10.7270/Q2QZ28V2
Beta-secretase 2
(Homo sapiens (Human))
BDBM236598
(US9365589, 1y)
Show SMILES CC1(C)C(=N)N[C@]2(COC[C@H]2S1(=O)=O)c1cc(NC(=O)c2ccc(OCC#C)cn2)ccc1F |r|
Show InChI InChI=1S/C23H23FN4O5S/c1-4-9-33-15-6-8-18(26-11-15)20(29)27-14-5-7-17(24)16(10-14)23-13-32-12-19(23)34(30,31)22(2,3)21(25)28-23/h1,5-8,10-11,19H,9,12-13H2,2-3H3,(H2,25,28)(H,27,29)/t19-,23-/m1/s1
US Patent
7n/an/an/an/an/an/a5.0n/a
Merck Sharp & Dohme Corp.
US Patent
Assay Description
Inhibitor IC50s at purified human autoBACE-2 are determined in a time-resolved endpoint proteolysis assay that measures hydrolysis of the QSY7-EISEVN...
US Patent US9365589 (2016)
BindingDB Entry DOI: 10.7270/Q2QZ28V2