BDBM236685 US9388140, 26
SMILES: Cc1cc(F)cc(Oc2cc(NCCC(F)(F)F)c3ncn(-c4ccc(C(=O)NC5CC5)c(C)c4)c3c2)c1
InChI Key: InChIKey=GFFQYQRNOZWOLN-UHFFFAOYSA-N
Data: 1 IC50
Activity Spreadsheet -- Enzyme Inhibition Constant Data from BindingDB
Found 1 hit for monomerid = 236685
Trg + Lig
Ki
nM
ΔG°
kcal/mole
IC50
nM
Kd
nM
EC50/IC50
nM
koff
s-1
kon
M-1s-1
pHTemp
°C
Dual specificity protein kinase TTK
(Homo sapiens (Human))
BDBM236685
(US9388140, 26)
Show SMILES Cc1cc(F)cc(Oc2cc(NCCC(F)(F)F)c3ncn(-c4ccc(C(=O)NC5CC5)c(C)c4)c3c2)c1
Show InChI InChI=1S/C28H26F4N4O2/c1-16-9-18(29)12-21(10-16)38-22-13-24(33-8-7-28(30,31)32)26-25(14-22)36(15-34-26)20-5-6-23(17(2)11-20)27(37)35-19-3-4-19/h5-6,9-15,19,33H,3-4,7-8H2,1-2H3,(H,35,37)
US Patent
n/an/a 1.80n/an/an/an/a7.722
Bayer Intellectual Property GmbH
US Patent
Assay Description
For the assay 50 nL of a 100-fold concentrated solution of the test compound in DMSO was pipetted into a black low volume 384 well microtiter plate (...
US Patent US9388140 (2016)
BindingDB Entry DOI: 10.7270/Q2BP01QF