BDBM23701 4-chloro-1-[(3-nitrophenyl)carbonyl]-1H-pyrazole::N-Benzoylpyrazole deriv., 3
SMILES: [O-][N+](=O)c1cccc(c1)C(=O)n1cc(Cl)cn1
InChI Key: InChIKey=BKMXGSZQEWHCJH-UHFFFAOYSA-N
Data: 1 KI  4 IC50
Activity Spreadsheet -- Enzyme Inhibition Constant Data from BindingDB
Found 7 hits for monomerid = 23701
Trg + Lig
Ki
nM
ΔG°
kcal/mole
IC50
nM
Kd
nM
EC50/IC50
nM
koff
s-1
kon
M-1s-1
pHTemp
°C
Leukocyte elastase
(Homo sapiens (Human))
BDBM23701
(4-chloro-1-[(3-nitrophenyl)carbonyl]-1H-pyrazole |...)
Show SMILES [O-][N+](=O)c1cccc(c1)C(=O)n1cc(Cl)cn1
Show InChI InChI=1S/C10H6ClN3O3/c11-8-5-12-13(6-8)10(15)7-2-1-3-9(4-7)14(16)17/h1-6H
Reactome pathway
24 -10.4n/an/an/an/an/a7.525
Montana State University
Assay Description
HTS was performed in black flat-bottom 96-well microtiter plates. The reaction was initiated by addition of elastase substrate to the reaction buffer...
J Med Chem 50: 4928-38 (2007)
Article DOI: 10.1021/jm070600+
BindingDB Entry DOI: 10.7270/Q2ST7N5S
Prothrombin
(Homo sapiens (Human))
BDBM23701
(4-chloro-1-[(3-nitrophenyl)carbonyl]-1H-pyrazole |...)
Show SMILES [O-][N+](=O)c1cccc(c1)C(=O)n1cc(Cl)cn1
Show InChI InChI=1S/C10H6ClN3O3/c11-8-5-12-13(6-8)10(15)7-2-1-3-9(4-7)14(16)17/h1-6H
n/an/a 680n/an/an/an/an/an/a
Montana State University
Assay Description
Thrombin activity was monitored at excitation and emission wavelengths of 355 and 460 nm, respectively. For all compounds tested, the concentration o...
J Med Chem 50: 4928-38 (2007)
Article DOI: 10.1021/jm070600+
BindingDB Entry DOI: 10.7270/Q2ST7N5S
Cathepsin D
(Homo sapiens (Human))
BDBM23701
(4-chloro-1-[(3-nitrophenyl)carbonyl]-1H-pyrazole |...)
Show SMILES [O-][N+](=O)c1cccc(c1)C(=O)n1cc(Cl)cn1
Show InChI InChI=1S/C10H6ClN3O3/c11-8-5-12-13(6-8)10(15)7-2-1-3-9(4-7)14(16)17/h1-6H
NCI pathway
Reactome pathway
n/an/an/an/an/an/an/an/an/a
Montana State University
Assay Description
Cathepsin D assays were monitored with a Fluoroskan Ascent FL microtiter plate reader at excitation and emission wavelengths of 340 and 390 nm, respe...
J Med Chem 50: 4928-38 (2007)
Article DOI: 10.1021/jm070600+
BindingDB Entry DOI: 10.7270/Q2ST7N5S
Plasma kallikrein
(Homo sapiens (Human))
BDBM23701
(4-chloro-1-[(3-nitrophenyl)carbonyl]-1H-pyrazole |...)
Show SMILES [O-][N+](=O)c1cccc(c1)C(=O)n1cc(Cl)cn1
Show InChI InChI=1S/C10H6ClN3O3/c11-8-5-12-13(6-8)10(15)7-2-1-3-9(4-7)14(16)17/h1-6H
n/an/a 1.13E+4n/an/an/an/an/an/a
Montana State University
Assay Description
Kallikrein activity was monitored at excitation and emission wavelengths of 355 and 460 nm, respectively. For all compounds tested, the concentration...
J Med Chem 50: 4928-38 (2007)
Article DOI: 10.1021/jm070600+
BindingDB Entry DOI: 10.7270/Q2ST7N5S
Aminopeptidase N
(Sus scrofa (Pig))
BDBM23701
(4-chloro-1-[(3-nitrophenyl)carbonyl]-1H-pyrazole |...)
Show SMILES [O-][N+](=O)c1cccc(c1)C(=O)n1cc(Cl)cn1
Show InChI InChI=1S/C10H6ClN3O3/c11-8-5-12-13(6-8)10(15)7-2-1-3-9(4-7)14(16)17/h1-6H
n/an/an/an/an/an/an/an/an/a
Montana State University
Assay Description
Reactions for aminopeptidase M activity were monitored at 405 nm using a SpectraMax Plus microplate reader. For all compounds tested, the concentrati...
J Med Chem 50: 4928-38 (2007)
Article DOI: 10.1021/jm070600+
BindingDB Entry DOI: 10.7270/Q2ST7N5S
Chymotrypsin
(Homo sapiens (Human))
BDBM23701
(4-chloro-1-[(3-nitrophenyl)carbonyl]-1H-pyrazole |...)
Show SMILES [O-][N+](=O)c1cccc(c1)C(=O)n1cc(Cl)cn1
Show InChI InChI=1S/C10H6ClN3O3/c11-8-5-12-13(6-8)10(15)7-2-1-3-9(4-7)14(16)17/h1-6H
n/an/a 340n/an/an/an/an/an/a
Montana State University
Assay Description
Chymotrypsin activity was monitored at excitation and emission wavelengths of 355 and 460 nm, respectively. For all compounds tested, the concentrati...
J Med Chem 50: 4928-38 (2007)
Article DOI: 10.1021/jm070600+
BindingDB Entry DOI: 10.7270/Q2ST7N5S
Urokinase-type plasminogen activator
(Homo sapiens (Human))
BDBM23701
(4-chloro-1-[(3-nitrophenyl)carbonyl]-1H-pyrazole |...)
Show SMILES [O-][N+](=O)c1cccc(c1)C(=O)n1cc(Cl)cn1
Show InChI InChI=1S/C10H6ClN3O3/c11-8-5-12-13(6-8)10(15)7-2-1-3-9(4-7)14(16)17/h1-6H
Reactome pathway
n/an/a 170n/an/an/an/an/an/a
Montana State University
Assay Description
Urokinase activity was monitored at excitation and emission wavelengths of 355 and 460 nm, respectively. For all compounds tested, the concentration ...
J Med Chem 50: 4928-38 (2007)
Article DOI: 10.1021/jm070600+
BindingDB Entry DOI: 10.7270/Q2ST7N5S