BDBM23719 4-bromo-1-[(2-chloro-4,5-difluorophenyl)carbonyl]-1H-pyrazole::N-Benzoylpyrazole deriv., 27
SMILES: Fc1cc(Cl)c(cc1F)C(=O)n1cc(Br)cn1
InChI Key: InChIKey=SSRIKTAQJWMPPG-UHFFFAOYSA-N
Data: 1 KI  2 IC50
Activity Spreadsheet -- Enzyme Inhibition Constant Data from BindingDB
Found 7 hits for monomerid = 23719
Trg + Lig
Ki
nM
ΔG°
kcal/mole
IC50
nM
Kd
nM
EC50/IC50
nM
koff
s-1
kon
M-1s-1
pHTemp
°C
Leukocyte elastase
(Homo sapiens (Human))
BDBM23719
(4-bromo-1-[(2-chloro-4,5-difluorophenyl)carbonyl]-...)
Show SMILES Fc1cc(Cl)c(cc1F)C(=O)n1cc(Br)cn1
Show InChI InChI=1S/C10H4BrClF2N2O/c11-5-3-15-16(4-5)10(17)6-1-8(13)9(14)2-7(6)12/h1-4H
Reactome pathway
7.20E+3 -7.01n/an/an/an/an/a7.525
Montana State University
Assay Description
HTS was performed in black flat-bottom 96-well microtiter plates. The reaction was initiated by addition of elastase substrate to the reaction buffer...
J Med Chem 50: 4928-38 (2007)
Article DOI: 10.1021/jm070600+
BindingDB Entry DOI: 10.7270/Q2ST7N5S
Prothrombin
(Homo sapiens (Human))
BDBM23719
(4-bromo-1-[(2-chloro-4,5-difluorophenyl)carbonyl]-...)
Show SMILES Fc1cc(Cl)c(cc1F)C(=O)n1cc(Br)cn1
Show InChI InChI=1S/C10H4BrClF2N2O/c11-5-3-15-16(4-5)10(17)6-1-8(13)9(14)2-7(6)12/h1-4H
n/an/an/an/an/an/an/an/an/a
Montana State University
Assay Description
Thrombin activity was monitored at excitation and emission wavelengths of 355 and 460 nm, respectively. For all compounds tested, the concentration o...
J Med Chem 50: 4928-38 (2007)
Article DOI: 10.1021/jm070600+
BindingDB Entry DOI: 10.7270/Q2ST7N5S
Cathepsin D
(Homo sapiens (Human))
BDBM23719
(4-bromo-1-[(2-chloro-4,5-difluorophenyl)carbonyl]-...)
Show SMILES Fc1cc(Cl)c(cc1F)C(=O)n1cc(Br)cn1
Show InChI InChI=1S/C10H4BrClF2N2O/c11-5-3-15-16(4-5)10(17)6-1-8(13)9(14)2-7(6)12/h1-4H
NCI pathway
Reactome pathway
n/an/an/an/an/an/an/an/an/a
Montana State University
Assay Description
Cathepsin D assays were monitored with a Fluoroskan Ascent FL microtiter plate reader at excitation and emission wavelengths of 340 and 390 nm, respe...
J Med Chem 50: 4928-38 (2007)
Article DOI: 10.1021/jm070600+
BindingDB Entry DOI: 10.7270/Q2ST7N5S
Plasma kallikrein
(Homo sapiens (Human))
BDBM23719
(4-bromo-1-[(2-chloro-4,5-difluorophenyl)carbonyl]-...)
Show SMILES Fc1cc(Cl)c(cc1F)C(=O)n1cc(Br)cn1
Show InChI InChI=1S/C10H4BrClF2N2O/c11-5-3-15-16(4-5)10(17)6-1-8(13)9(14)2-7(6)12/h1-4H
n/an/an/an/an/an/an/an/an/a
Montana State University
Assay Description
Kallikrein activity was monitored at excitation and emission wavelengths of 355 and 460 nm, respectively. For all compounds tested, the concentration...
J Med Chem 50: 4928-38 (2007)
Article DOI: 10.1021/jm070600+
BindingDB Entry DOI: 10.7270/Q2ST7N5S
Aminopeptidase N
(Sus scrofa (Pig))
BDBM23719
(4-bromo-1-[(2-chloro-4,5-difluorophenyl)carbonyl]-...)
Show SMILES Fc1cc(Cl)c(cc1F)C(=O)n1cc(Br)cn1
Show InChI InChI=1S/C10H4BrClF2N2O/c11-5-3-15-16(4-5)10(17)6-1-8(13)9(14)2-7(6)12/h1-4H
n/an/an/an/an/an/an/an/an/a
Montana State University
Assay Description
Reactions for aminopeptidase M activity were monitored at 405 nm using a SpectraMax Plus microplate reader. For all compounds tested, the concentrati...
J Med Chem 50: 4928-38 (2007)
Article DOI: 10.1021/jm070600+
BindingDB Entry DOI: 10.7270/Q2ST7N5S
Chymotrypsin
(Homo sapiens (Human))
BDBM23719
(4-bromo-1-[(2-chloro-4,5-difluorophenyl)carbonyl]-...)
Show SMILES Fc1cc(Cl)c(cc1F)C(=O)n1cc(Br)cn1
Show InChI InChI=1S/C10H4BrClF2N2O/c11-5-3-15-16(4-5)10(17)6-1-8(13)9(14)2-7(6)12/h1-4H
n/an/a 7.30E+3n/an/an/an/an/an/a
Montana State University
Assay Description
Chymotrypsin activity was monitored at excitation and emission wavelengths of 355 and 460 nm, respectively. For all compounds tested, the concentrati...
J Med Chem 50: 4928-38 (2007)
Article DOI: 10.1021/jm070600+
BindingDB Entry DOI: 10.7270/Q2ST7N5S
Urokinase-type plasminogen activator
(Homo sapiens (Human))
BDBM23719
(4-bromo-1-[(2-chloro-4,5-difluorophenyl)carbonyl]-...)
Show SMILES Fc1cc(Cl)c(cc1F)C(=O)n1cc(Br)cn1
Show InChI InChI=1S/C10H4BrClF2N2O/c11-5-3-15-16(4-5)10(17)6-1-8(13)9(14)2-7(6)12/h1-4H
Reactome pathway
n/an/a 2.83E+4n/an/an/an/an/an/a
Montana State University
Assay Description
Urokinase activity was monitored at excitation and emission wavelengths of 355 and 460 nm, respectively. For all compounds tested, the concentration ...
J Med Chem 50: 4928-38 (2007)
Article DOI: 10.1021/jm070600+
BindingDB Entry DOI: 10.7270/Q2ST7N5S