null
SMILES: OCCOc1ccc(cc1)-c1c(F)cc2[nH]cc(C(O)=O)c2c1F
InChI Key: InChIKey=QWKKIHLNFWNSMF-UHFFFAOYSA-N
Activity Spreadsheet -- Enzyme Inhibition Constant Data from BindingDB
Found 1 hit for monomerid = 237943
Trg + Lig
Ki
nM
ΔG°
kcal/mole
IC50
nM
Kd
nM
EC50/IC50
nM
koff
s-1
kon
M-1s-1
pHTemp
°C
5'-AMP-activated protein kinase catalytic subunit alpha-1/subunit beta-1/subunit gamma-1
(Homo sapiens (Human))
BDBM237943
(US9394285, 24)
Show SMILES OCCOc1ccc(cc1)-c1c(F)cc2[nH]cc(C(O)=O)c2c1F
Show InChI InChI=1S/C17H13F2NO4/c18-12-7-13-15(11(8-20-13)17(22)23)16(19)14(12)9-1-3-10(4-2-9)24-6-5-21/h1-4,7-8,20-21H,5-6H2,(H,22,23)
US Patent
n/an/an/an/a 252n/an/a7.525
Pfizer Inc.
US Patent
Assay Description
The biochemical EC50 (half-maximal concentration required for full activation) of compounds for the activation of AMPK was evaluated by 33P-based ass...
US Patent US9394285 (2016)
BindingDB Entry DOI: 10.7270/Q2DB80Q7