BDBM237956 US9394285, 37
SMILES: COc1ccc(cc1OC)-c1cc2c(c[nH]c2cc1Cl)C(O)=O
InChI Key: InChIKey=NKWXFQYOHBYQEJ-UHFFFAOYSA-N
Data: 1 EC50
Activity Spreadsheet -- Enzyme Inhibition Constant Data from BindingDB
Found 1 hit for monomerid = 237956
Trg + Lig
Ki
nM
ΔG°
kcal/mole
IC50
nM
Kd
nM
EC50/IC50
nM
koff
s-1
kon
M-1s-1
pHTemp
°C
5'-AMP-activated protein kinase catalytic subunit alpha-1/subunit beta-1/subunit gamma-1
(Homo sapiens (Human))
BDBM237956
(US9394285, 37)
Show SMILES COc1ccc(cc1OC)-c1cc2c(c[nH]c2cc1Cl)C(O)=O
Show InChI InChI=1S/C17H14ClNO4/c1-22-15-4-3-9(5-16(15)23-2)10-6-11-12(17(20)21)8-19-14(11)7-13(10)18/h3-8,19H,1-2H3,(H,20,21)
US Patent
n/an/an/an/a 248n/an/a7.525
Pfizer Inc.
US Patent
Assay Description
The biochemical EC50 (half-maximal concentration required for full activation) of compounds for the activation of AMPK was evaluated by 33P-based ass...
US Patent US9394285 (2016)
BindingDB Entry DOI: 10.7270/Q2DB80Q7