BDBM237963 US9394285, 44
SMILES: COc1ccc(c(F)c1)-c1cc2c(c[nH]c2cc1Cl)C(O)=O
InChI Key: InChIKey=PUMYBZFSATYODJ-UHFFFAOYSA-N
Data: 1 EC50
Activity Spreadsheet -- Enzyme Inhibition Constant Data from BindingDB
Found 1 hit for monomerid = 237963
Trg + Lig
Ki
nM
ΔG°
kcal/mole
IC50
nM
Kd
nM
EC50/IC50
nM
koff
s-1
kon
M-1s-1
pHTemp
°C
5'-AMP-activated protein kinase Complex 1
(Homo sapiens (Human))
BDBM237963
(US9394285, 44)
Show SMILES COc1ccc(c(F)c1)-c1cc2c(c[nH]c2cc1Cl)C(O)=O
Show InChI InChI=1S/C16H11ClFNO3/c1-22-8-2-3-9(14(18)4-8)10-5-11-12(16(20)21)7-19-15(11)6-13(10)17/h2-7,19H,1H3,(H,20,21)
US Patent
n/an/an/an/a 85n/an/a7.525
Pfizer Inc.
US Patent
Assay Description
The biochemical EC50 (half-maximal concentration required for full activation) of compounds for the activation of AMPK was evaluated by 33P-based ass...
US Patent US9394285 (2016)
BindingDB Entry DOI: 10.7270/Q2DB80Q7