BDBM237965 US9394285, 47
SMILES: OC(=O)c1c[nH]c2cc(Cl)c(cc12)-c1ccc(OC[C@@H]2CCCN2)cc1
InChI Key:
Data: 1 EC50
Activity Spreadsheet -- Enzyme Inhibition Constant Data from BindingDB
Found 1 hit for monomerid = 237965
Trg + Lig
Ki
nM
ΔG°
kcal/mole
IC50
nM
Kd
nM
EC50/IC50
nM
koff
s-1
kon
M-1s-1
pHTemp
°C
5'-AMP-activated protein kinase Complex 1
(Homo sapiens (Human))
BDBM237965
(US9394285, 47)
Show SMILES OC(=O)c1c[nH]c2cc(Cl)c(cc12)-c1ccc(OC[C@@H]2CCCN2)cc1 |r|
US Patent
n/an/an/an/a 65.3n/an/a7.525
Pfizer Inc.
US Patent
Assay Description
The biochemical EC50 (half-maximal concentration required for full activation) of compounds for the activation of AMPK was evaluated by 33P-based ass...
US Patent US9394285 (2016)
BindingDB Entry DOI: 10.7270/Q2DB80Q7