BDBM238116 US9394289, 12
SMILES: CC1(C)CCC(=CC1)c1cc(ccc1NC(=O)c1nc(c[nH]1)C#N)C1(O)CCS(=O)(=O)CC1
InChI Key: InChIKey=CFBZXKHPVPVDBF-UHFFFAOYSA-N
Data: 1 IC50
Activity Spreadsheet -- Enzyme Inhibition Constant Data from BindingDB
Found 1 hit for monomerid = 238116
Trg + Lig
Ki
nM
ΔG°
kcal/mole
IC50
nM
Kd
nM
EC50/IC50
nM
koff
s-1
kon
M-1s-1
pHTemp
°C
Macrophage colony-stimulating factor 1 receptor (c-Fms)
(Mus musculus (Mouse))
BDBM238116
(US9394289, 12)
Show SMILES CC1(C)CCC(=CC1)c1cc(ccc1NC(=O)c1nc(c[nH]1)C#N)C1(O)CCS(=O)(=O)CC1 |c:5|
Show InChI InChI=1S/C24H28N4O4S/c1-23(2)7-5-16(6-8-23)19-13-17(24(30)9-11-33(31,32)12-10-24)3-4-20(19)28-22(29)21-26-15-18(14-25)27-21/h3-5,13,15,30H,6-12H2,1-2H3,(H,26,27)(H,28,29)
US Patent
n/an/a 1.10n/an/an/an/a7.525
Janssen Pharmaceutica NV
US Patent
Assay Description
An autophosphorylation, fluorescence polarization competition immunoassay was used to determine the potency for c-fms inhibition exhibited by selecte...
US Patent US9394289 (2016)
BindingDB Entry DOI: 10.7270/Q28K780X