BDBM238121 US9394289, 17
SMILES: CC1(C)CCC(=CC1)c1cc(ccc1NC(=O)c1nc(c[nH]1)C#N)C1(CCOCC1)C(O)=O
InChI Key: InChIKey=VLFUUNCPLZBXTA-UHFFFAOYSA-N
Data: 1 IC50
Activity Spreadsheet -- Enzyme Inhibition Constant Data from BindingDB
Found 1 hit for monomerid = 238121
Trg + Lig
Ki
nM
ΔG°
kcal/mole
IC50
nM
Kd
nM
EC50/IC50
nM
koff
s-1
kon
M-1s-1
pHTemp
°C
Macrophage colony-stimulating factor 1 receptor (c-Fms)
(Mus musculus (Mouse))
BDBM238121
(US9394289, 17)
Show SMILES CC1(C)CCC(=CC1)c1cc(ccc1NC(=O)c1nc(c[nH]1)C#N)C1(CCOCC1)C(O)=O |c:5|
Show InChI InChI=1S/C25H28N4O4/c1-24(2)7-5-16(6-8-24)19-13-17(25(23(31)32)9-11-33-12-10-25)3-4-20(19)29-22(30)21-27-15-18(14-26)28-21/h3-5,13,15H,6-12H2,1-2H3,(H,27,28)(H,29,30)(H,31,32)
US Patent
n/an/a 0.560n/an/an/an/a7.525
Janssen Pharmaceutica NV
US Patent
Assay Description
An autophosphorylation, fluorescence polarization competition immunoassay was used to determine the potency for c-fms inhibition exhibited by selecte...
US Patent US9394289 (2016)
BindingDB Entry DOI: 10.7270/Q28K780X