null
SMILES: N[C@@H](CSC1(c2ccccc2-c2ccccc12)c1ccc(Cl)cc1)C(O)=O
InChI Key: InChIKey=BZRSNJXOHYRQSB-FQEVSTJZSA-N
Activity Spreadsheet -- Enzyme Inhibition Constant Data from BindingDB
Found 2 hits for monomerid = 23834
Trg + Lig
Ki
nM
ΔG°
kcal/mole
IC50
nM
Kd
nM
EC50/IC50
nM
koff
s-1
kon
M-1s-1
pHTemp
°C
Probable nicotinate-nucleotide adenylyltransferase
(Staphylococcus aureus subsp. aureus N315)
BDBM23834
((2R)-2-amino-3-{[9-(4-chlorophenyl)-9H-fluoren-9-y...)
Show SMILES N[C@@H](CSC1(c2ccccc2-c2ccccc12)c1ccc(Cl)cc1)C(O)=O |r|
Show InChI InChI=1S/C22H18ClNO2S/c23-15-11-9-14(10-12-15)22(27-13-20(24)21(25)26)18-7-3-1-5-16(18)17-6-2-4-8-19(17)22/h1-12,20H,13,24H2,(H,25,26)/t20-/m0/s1
PCBioAssay
n/an/a 3.42E+4n/an/an/an/an/an/a
Burnham Center for Chemical Genomics
Curated by PubChem BioAssay
PubChem Bioassay (2012)
BindingDB Entry DOI: 10.7270/Q2BV7F7H
Kinesin-like protein KIF11
(Homo sapiens (Human))
BDBM23834
((2R)-2-amino-3-{[9-(4-chlorophenyl)-9H-fluoren-9-y...)
Show SMILES N[C@@H](CSC1(c2ccccc2-c2ccccc12)c1ccc(Cl)cc1)C(O)=O |r|
Show InChI InChI=1S/C22H18ClNO2S/c23-15-11-9-14(10-12-15)22(27-13-20(24)21(25)26)18-7-3-1-5-16(18)17-6-2-4-8-19(17)22/h1-12,20H,13,24H2,(H,25,26)/t20-/m0/s1
Reactome pathway
n/an/an/an/an/an/an/an/a25
Institut de Biologie Structurale
Assay Description
The microtubule-activated ATPase rates were measured using the pyruvate kinase/lactate dehydrogenase-linked assay. To optimize the signal for basal E...
J Med Chem 51: 1115-25 (2008)
Article DOI: 10.1021/jm070606z
BindingDB Entry DOI: 10.7270/Q2DJ5CXD