BDBM239130 US10195181, Example 21.2::US9403810, 21.2
SMILES: Cc1c(onc1C(=O)Nc1c(C)n(C)n(C2CCCCC2)c1=O)C1CC=C(C)CO1
InChI Key: InChIKey=MXLPXKIENJVXBU-UHFFFAOYSA-N
Data: 2 IC50
Activity Spreadsheet -- Enzyme Inhibition Constant Data from BindingDB
Found 2 hits for monomerid = 239130
Trg + Lig
Ki
nM
ΔG°
kcal/mole
IC50
nM
Kd
nM
EC50/IC50
nM
koff
s-1
kon
M-1s-1
pHTemp
°C
E3 ubiquitin-protein ligase SMURF1
(Homo sapiens (Human))
BDBM239130
(US10195181, Example 21.2 | US9403810, 21.2)
Show SMILES Cc1c(onc1C(=O)Nc1c(C)n(C)n(C2CCCCC2)c1=O)C1CC=C(C)CO1 |t:28|
Show InChI InChI=1S/C22H30N4O4/c1-13-10-11-17(29-12-13)20-14(2)18(24-30-20)21(27)23-19-15(3)25(4)26(22(19)28)16-8-6-5-7-9-16/h10,16-17H,5-9,11-12H2,1-4H3,(H,23,27)
US Patent
n/an/a 490n/an/an/an/an/an/a
Novartis AG
US Patent
Assay Description
To determine the HECT E3 ligase selectivity of the compounds, a panel of biochemical HECT E3 ligase autoubiquitinylation assays was employed (Smurf-1...
US Patent US10195181 (2019)
BindingDB Entry DOI: 10.7270/Q28054Q2
HECT-type E3 ubiquitin transferase SMURF1
(Homo sapiens (Human))
BDBM239130
(US10195181, Example 21.2 | US9403810, 21.2)
Show SMILES Cc1c(onc1C(=O)Nc1c(C)n(C)n(C2CCCCC2)c1=O)C1CC=C(C)CO1 |t:28|
Show InChI InChI=1S/C22H30N4O4/c1-13-10-11-17(29-12-13)20-14(2)18(24-30-20)21(27)23-19-15(3)25(4)26(22(19)28)16-8-6-5-7-9-16/h10,16-17H,5-9,11-12H2,1-4H3,(H,23,27)
US Patent
n/an/a 490n/an/an/an/an/a25
Novartis AG
US Patent
Assay Description
For the biochemical assay panel, 50 nl of the test compounds, reference compounds and buffer/DMSO control are transferred to the respective wells of ...
US Patent US9403810 (2016)
BindingDB Entry DOI: 10.7270/Q22V2F1F