BDBM23978 (3Z)-3-[(3-phenylpropoxy)imino]-1,2,3,4-tetrahydronaphthalen-2-amine hydrochloride::Tetralone-oxime derivative, 2e
SMILES: NC1Cc2ccccc2C\C1=N\OCCCc1ccccc1
InChI Key: InChIKey=WZCCQYWEZJGEMF-VZCXRCSSSA-N
Data: 2 KI  2 IC50
Activity Spreadsheet -- Enzyme Inhibition Constant Data from BindingDB
Found 4 hits for monomerid = 23978
Trg + Lig
Ki
nM
ΔG°
kcal/mole
IC50
nM
Kd
nM
EC50/IC50
nM
koff
s-1
kon
M-1s-1
pHTemp
°C
Leukotriene A4 hydrolase
(Homo sapiens (Human))
BDBM23978
((3Z)-3-[(3-phenylpropoxy)imino]-1,2,3,4-tetrahydro...)
Show SMILES NC1Cc2ccccc2C\C1=N\OCCCc1ccccc1
Show InChI InChI=1S/C19H22N2O/c20-18-13-16-10-4-5-11-17(16)14-19(18)21-22-12-6-9-15-7-2-1-3-8-15/h1-5,7-8,10-11,18H,6,9,12-14,20H2/b21-19-
Reactome pathway
6.00E+3n/an/an/an/an/an/an/an/a
ENSCMu
Assay Description
Spectrophotometric assays were performed by monitoring hydrolysis of chromogenic substrate. The release of para-nitroaniline at 405 nm was measured t...
Bioorg Med Chem 14: 7241-57 (2006)
Article DOI: 10.1016/j.bmc.2006.06.050
BindingDB Entry DOI: 10.7270/Q2N29V73
Aminopeptidase N
(Sus scrofa (Pig))
BDBM23978
((3Z)-3-[(3-phenylpropoxy)imino]-1,2,3,4-tetrahydro...)
Show SMILES NC1Cc2ccccc2C\C1=N\OCCCc1ccccc1
Show InChI InChI=1S/C19H22N2O/c20-18-13-16-10-4-5-11-17(16)14-19(18)21-22-12-6-9-15-7-2-1-3-8-15/h1-5,7-8,10-11,18H,6,9,12-14,20H2/b21-19-
1.10E+5n/an/an/an/an/an/an/an/a
ENSCMu
Assay Description
Spectrophotometric assays were performed by monitoring hydrolysis of chromogenic substrate. The release of para-nitroaniline at 405 nm was measured t...
Bioorg Med Chem 14: 7241-57 (2006)
Article DOI: 10.1016/j.bmc.2006.06.050
BindingDB Entry DOI: 10.7270/Q2N29V73
Cytosol aminopeptidase
(Bos taurus (bovine))
BDBM23978
((3Z)-3-[(3-phenylpropoxy)imino]-1,2,3,4-tetrahydro...)
Show SMILES NC1Cc2ccccc2C\C1=N\OCCCc1ccccc1
Show InChI InChI=1S/C19H22N2O/c20-18-13-16-10-4-5-11-17(16)14-19(18)21-22-12-6-9-15-7-2-1-3-8-15/h1-5,7-8,10-11,18H,6,9,12-14,20H2/b21-19-
n/an/a>1.00E+6n/an/an/an/a8.030
ENSCMu
Assay Description
Spectrophotometric assays were performed by monitoring hydrolysis of chromogenic substrate. The release of para-nitroaniline at 405 nm was measured t...
Bioorg Med Chem 14: 7241-57 (2006)
Article DOI: 10.1016/j.bmc.2006.06.050
BindingDB Entry DOI: 10.7270/Q2N29V73
Bacterial leucyl aminopeptidase
(Vibrio proteolyticus)
BDBM23978
((3Z)-3-[(3-phenylpropoxy)imino]-1,2,3,4-tetrahydro...)
Show SMILES NC1Cc2ccccc2C\C1=N\OCCCc1ccccc1
Show InChI InChI=1S/C19H22N2O/c20-18-13-16-10-4-5-11-17(16)14-19(18)21-22-12-6-9-15-7-2-1-3-8-15/h1-5,7-8,10-11,18H,6,9,12-14,20H2/b21-19-
n/an/a 3.00E+5n/an/an/an/a8.030
ENSCMu
Assay Description
Spectrophotometric assays were performed by monitoring hydrolysis of chromogenic substrate. The release of para-nitroaniline at 405 nm was measured t...
Bioorg Med Chem 14: 7241-57 (2006)
Article DOI: 10.1016/j.bmc.2006.06.050
BindingDB Entry DOI: 10.7270/Q2N29V73