BDBM23983 3-amino-N-hydroxy-1,2,3,4-tetrahydronaphthalene-2-carboxamide hydrochloride::tetrahydronaphthalene-2-carbohydroxamic acid, 3c
SMILES: NC1Cc2ccccc2CC1C(=O)NO
InChI Key: InChIKey=YNLSOTBYCNJRBN-UHFFFAOYSA-N
Data: 3 KI  1 IC50
Activity Spreadsheet -- Enzyme Inhibition Constant Data from BindingDB
Found 4 hits for monomerid = 23983
Trg + Lig
Ki
nM
ΔG°
kcal/mole
IC50
nM
Kd
nM
EC50/IC50
nM
koff
s-1
kon
M-1s-1
pHTemp
°C
Bacterial leucyl aminopeptidase
(Vibrio proteolyticus)
BDBM23983
(3-amino-N-hydroxy-1,2,3,4-tetrahydronaphthalene-2-...)
Show SMILES NC1Cc2ccccc2CC1C(=O)NO
Show InChI InChI=1S/C11H14N2O2/c12-10-6-8-4-2-1-3-7(8)5-9(10)11(14)13-15/h1-4,9-10,15H,5-6,12H2,(H,13,14)
4.00E+3n/an/an/an/an/an/an/an/a
ENSCMu
Assay Description
Spectrophotometric assays were performed by monitoring hydrolysis of chromogenic substrate. The release of para-nitroaniline at 405 nm was measured t...
Bioorg Med Chem 14: 7241-57 (2006)
Article DOI: 10.1016/j.bmc.2006.06.050
BindingDB Entry DOI: 10.7270/Q2N29V73
Aminopeptidase N
(Sus scrofa (Pig))
BDBM23983
(3-amino-N-hydroxy-1,2,3,4-tetrahydronaphthalene-2-...)
Show SMILES NC1Cc2ccccc2CC1C(=O)NO
Show InChI InChI=1S/C11H14N2O2/c12-10-6-8-4-2-1-3-7(8)5-9(10)11(14)13-15/h1-4,9-10,15H,5-6,12H2,(H,13,14)
4.00E+3n/an/an/an/an/an/an/an/a
ENSCMu
Assay Description
Spectrophotometric assays were performed by monitoring hydrolysis of chromogenic substrate. The release of para-nitroaniline at 405 nm was measured t...
Bioorg Med Chem 14: 7241-57 (2006)
Article DOI: 10.1016/j.bmc.2006.06.050
BindingDB Entry DOI: 10.7270/Q2N29V73
Cytosol aminopeptidase
(Bos taurus (bovine))
BDBM23983
(3-amino-N-hydroxy-1,2,3,4-tetrahydronaphthalene-2-...)
Show SMILES NC1Cc2ccccc2CC1C(=O)NO
Show InChI InChI=1S/C11H14N2O2/c12-10-6-8-4-2-1-3-7(8)5-9(10)11(14)13-15/h1-4,9-10,15H,5-6,12H2,(H,13,14)
1.00E+4 -6.93n/an/an/an/an/a8.030
ENSCMu
Assay Description
Spectrophotometric assays were performed by monitoring hydrolysis of chromogenic substrate. The release of para-nitroaniline at 405 nm was measured t...
Bioorg Med Chem 14: 7241-57 (2006)
Article DOI: 10.1016/j.bmc.2006.06.050
BindingDB Entry DOI: 10.7270/Q2N29V73
Leukotriene A4 hydrolase
(Homo sapiens (Human))
BDBM23983
(3-amino-N-hydroxy-1,2,3,4-tetrahydronaphthalene-2-...)
Show SMILES NC1Cc2ccccc2CC1C(=O)NO
Show InChI InChI=1S/C11H14N2O2/c12-10-6-8-4-2-1-3-7(8)5-9(10)11(14)13-15/h1-4,9-10,15H,5-6,12H2,(H,13,14)
Reactome pathway
n/an/a>1.00E+6n/an/an/an/an/an/a
ENSCMu
Assay Description
Spectrophotometric assays were performed by monitoring hydrolysis of chromogenic substrate. The release of para-nitroaniline at 405 nm was measured t...
Bioorg Med Chem 14: 7241-57 (2006)
Article DOI: 10.1016/j.bmc.2006.06.050
BindingDB Entry DOI: 10.7270/Q2N29V73