BDBM240290 US9409866, 5
SMILES: OC1(CNC(=O)c2cc(OCC3CC3)c(Cl)cn2)CCCCC1
InChI Key: InChIKey=WQTYHCUSVSTIOQ-UHFFFAOYSA-N
Data: 2 EC50
Activity Spreadsheet -- Enzyme Inhibition Constant Data from BindingDB
Found 2 hits for monomerid = 240290
Trg + Lig
Ki
nM
ΔG°
kcal/mole
IC50
nM
Kd
nM
EC50/IC50
nM
koff
s-1
kon
M-1s-1
pHTemp
°C
Cannabinoid receptor 1
(Homo sapiens (Human))
BDBM240290
(US9409866, 5)
Show SMILES OC1(CNC(=O)c2cc(OCC3CC3)c(Cl)cn2)CCCCC1
Show InChI InChI=1S/C17H23ClN2O3/c18-13-9-19-14(8-15(13)23-10-12-4-5-12)16(21)20-11-17(22)6-2-1-3-7-17/h8-9,12,22H,1-7,10-11H2,(H,20,21)
NCI pathway
Reactome pathway
US Patent
n/an/an/an/a>1.00E+4n/an/an/a37
HOFFMANN-LA ROCHE INC.
US Patent
Assay Description
CHO cells expressing human CB1 or CB2 receptors are seeded 17-24 hours prior to the experiment 50.000 cells per well in a black 96 well plate with fl...
US Patent US9409866 (2016)
BindingDB Entry DOI: 10.7270/Q2FX78BD
Cannabinoid receptor 2
(Homo sapiens (Human))
BDBM240290
(US9409866, 5)
Show SMILES OC1(CNC(=O)c2cc(OCC3CC3)c(Cl)cn2)CCCCC1
Show InChI InChI=1S/C17H23ClN2O3/c18-13-9-19-14(8-15(13)23-10-12-4-5-12)16(21)20-11-17(22)6-2-1-3-7-17/h8-9,12,22H,1-7,10-11H2,(H,20,21)
Reactome pathway
US Patent
n/an/an/an/a 107n/an/an/a37
HOFFMANN-LA ROCHE INC.
US Patent
Assay Description
CHO cells expressing human CB1 or CB2 receptors are seeded 17-24 hours prior to the experiment 50.000 cells per well in a black 96 well plate with fl...
US Patent US9409866 (2016)
BindingDB Entry DOI: 10.7270/Q2FX78BD