null
SMILES: CC(C)[C@](C)(CO)NC(=O)c1cc(OCC2CC2)c(Cl)cn1
InChI Key: InChIKey=CLLVWEHNEANLDH-INIZCTEOSA-N
Activity Spreadsheet -- Enzyme Inhibition Constant Data from BindingDB
Found 2 hits for monomerid = 240299
Trg + Lig
Ki
nM
ΔG°
kcal/mole
IC50
nM
Kd
nM
EC50/IC50
nM
koff
s-1
kon
M-1s-1
pHTemp
°C
Cannabinoid receptor 1
(Homo sapiens (Human))
BDBM240299
(US9409866, 14)
Show SMILES CC(C)[C@](C)(CO)NC(=O)c1cc(OCC2CC2)c(Cl)cn1 |r|
Show InChI InChI=1S/C16H23ClN2O3/c1-10(2)16(3,9-20)19-15(21)13-6-14(12(17)7-18-13)22-8-11-4-5-11/h6-7,10-11,20H,4-5,8-9H2,1-3H3,(H,19,21)/t16-/m0/s1
NCI pathway
Reactome pathway
US Patent
n/an/an/an/a 6.98E+3n/an/an/a37
HOFFMANN-LA ROCHE INC.
US Patent
Assay Description
CHO cells expressing human CB1 or CB2 receptors are seeded 17-24 hours prior to the experiment 50.000 cells per well in a black 96 well plate with fl...
US Patent US9409866 (2016)
BindingDB Entry DOI: 10.7270/Q2FX78BD
Cannabinoid receptor 2
(Homo sapiens (Human))
BDBM240299
(US9409866, 14)
Show SMILES CC(C)[C@](C)(CO)NC(=O)c1cc(OCC2CC2)c(Cl)cn1 |r|
Show InChI InChI=1S/C16H23ClN2O3/c1-10(2)16(3,9-20)19-15(21)13-6-14(12(17)7-18-13)22-8-11-4-5-11/h6-7,10-11,20H,4-5,8-9H2,1-3H3,(H,19,21)/t16-/m0/s1
Reactome pathway
US Patent
n/an/an/an/a 12.8n/an/an/a37
HOFFMANN-LA ROCHE INC.
US Patent
Assay Description
CHO cells expressing human CB1 or CB2 receptors are seeded 17-24 hours prior to the experiment 50.000 cells per well in a black 96 well plate with fl...
US Patent US9409866 (2016)
BindingDB Entry DOI: 10.7270/Q2FX78BD