null
SMILES: CC(C)[C@](C)(CO)NC(=O)c1cc(Cc2ccc(F)cc2)c(Cl)cn1
InChI Key: InChIKey=DJRWLGFKUICRDD-IBGZPJMESA-N
Activity Spreadsheet -- Enzyme Inhibition Constant Data from BindingDB
Found 2 hits for monomerid = 240300
Trg + Lig
Ki
nM
ΔG°
kcal/mole
IC50
nM
Kd
nM
EC50/IC50
nM
koff
s-1
kon
M-1s-1
pHTemp
°C
Cannabinoid receptor 1
(Homo sapiens (Human))
BDBM240300
(US9409866, 15)
Show SMILES CC(C)[C@](C)(CO)NC(=O)c1cc(Cc2ccc(F)cc2)c(Cl)cn1 |r|
Show InChI InChI=1S/C19H22ClFN2O2/c1-12(2)19(3,11-24)23-18(25)17-9-14(16(20)10-22-17)8-13-4-6-15(21)7-5-13/h4-7,9-10,12,24H,8,11H2,1-3H3,(H,23,25)/t19-/m0/s1
NCI pathway
Reactome pathway
US Patent
n/an/an/an/a>1.00E+4n/an/an/a37
HOFFMANN-LA ROCHE INC.
US Patent
Assay Description
CHO cells expressing human CB1 or CB2 receptors are seeded 17-24 hours prior to the experiment 50.000 cells per well in a black 96 well plate with fl...
US Patent US9409866 (2016)
BindingDB Entry DOI: 10.7270/Q2FX78BD
Cannabinoid receptor 2
(Homo sapiens (Human))
BDBM240300
(US9409866, 15)
Show SMILES CC(C)[C@](C)(CO)NC(=O)c1cc(Cc2ccc(F)cc2)c(Cl)cn1 |r|
Show InChI InChI=1S/C19H22ClFN2O2/c1-12(2)19(3,11-24)23-18(25)17-9-14(16(20)10-22-17)8-13-4-6-15(21)7-5-13/h4-7,9-10,12,24H,8,11H2,1-3H3,(H,23,25)/t19-/m0/s1
Reactome pathway
US Patent
n/an/an/an/a 5.80n/an/an/a37
HOFFMANN-LA ROCHE INC.
US Patent
Assay Description
CHO cells expressing human CB1 or CB2 receptors are seeded 17-24 hours prior to the experiment 50.000 cells per well in a black 96 well plate with fl...
US Patent US9409866 (2016)
BindingDB Entry DOI: 10.7270/Q2FX78BD