BDBM240312 US9409866, 27
SMILES: CC(C)C[C@@](C)(CO)NC(=O)c1cc(OCC2CC2)c(Cl)cn1
InChI Key: InChIKey=QSYHRAPPRQEOJJ-KRWDZBQOSA-N
Data: 2 EC50
Activity Spreadsheet -- Enzyme Inhibition Constant Data from BindingDB
Found 2 hits for monomerid = 240312
Trg + Lig
Ki
nM
ΔG°
kcal/mole
IC50
nM
Kd
nM
EC50/IC50
nM
koff
s-1
kon
M-1s-1
pHTemp
°C
Cannabinoid receptor 1
(Homo sapiens (Human))
BDBM240312
(US9409866, 27)
Show SMILES CC(C)C[C@@](C)(CO)NC(=O)c1cc(OCC2CC2)c(Cl)cn1 |r|
Show InChI InChI=1S/C17H25ClN2O3/c1-11(2)7-17(3,10-21)20-16(22)14-6-15(13(18)8-19-14)23-9-12-4-5-12/h6,8,11-12,21H,4-5,7,9-10H2,1-3H3,(H,20,22)/t17-/m0/s1
NCI pathway
Reactome pathway
US Patent
n/an/an/an/a>1.00E+4n/an/an/a37
HOFFMANN-LA ROCHE INC.
US Patent
Assay Description
CHO cells expressing human CB1 or CB2 receptors are seeded 17-24 hours prior to the experiment 50.000 cells per well in a black 96 well plate with fl...
US Patent US9409866 (2016)
BindingDB Entry DOI: 10.7270/Q2FX78BD
Cannabinoid receptor 2
(Homo sapiens (Human))
BDBM240312
(US9409866, 27)
Show SMILES CC(C)C[C@@](C)(CO)NC(=O)c1cc(OCC2CC2)c(Cl)cn1 |r|
Show InChI InChI=1S/C17H25ClN2O3/c1-11(2)7-17(3,10-21)20-16(22)14-6-15(13(18)8-19-14)23-9-12-4-5-12/h6,8,11-12,21H,4-5,7,9-10H2,1-3H3,(H,20,22)/t17-/m0/s1
Reactome pathway
US Patent
n/an/an/an/a 22.4n/an/an/a37
HOFFMANN-LA ROCHE INC.
US Patent
Assay Description
CHO cells expressing human CB1 or CB2 receptors are seeded 17-24 hours prior to the experiment 50.000 cells per well in a black 96 well plate with fl...
US Patent US9409866 (2016)
BindingDB Entry DOI: 10.7270/Q2FX78BD