BDBM240719 US9422243, 19
SMILES: NCCOc1c([nH]c(=O)c2cc(F)ccc12)-c1ccc2OCCOc2c1
InChI Key: InChIKey=OKZVWHVKFPRNLX-UHFFFAOYSA-N
Data: 1 IC50  2 Kd
Activity Spreadsheet -- Enzyme Inhibition Constant Data from BindingDB
Found 3 hits for monomerid = 240719
Trg + Lig
Ki
nM
ΔG°
kcal/mole
IC50
nM
Kd
nM
EC50/IC50
nM
koff
s-1
kon
M-1s-1
pHTemp
°C
Poly [ADP-ribose] polymerase 1
(Homo sapiens (Human))
BDBM240719
(US9422243, 19)
Show SMILES NCCOc1c([nH]c(=O)c2cc(F)ccc12)-c1ccc2OCCOc2c1
Show InChI InChI=1S/C19H17FN2O4/c20-12-2-3-13-14(10-12)19(23)22-17(18(13)26-6-5-21)11-1-4-15-16(9-11)25-8-7-24-15/h1-4,9-10H,5-8,21H2,(H,22,23)
US Patent
n/an/a 70n/an/an/an/an/a37
NERVIANO MEDICAL SCIENCES S.R.L. a corporation
US Patent
Assay Description
Studies were performed as follows: 6000 cells/well were seeded in 96 well plates (Perkin Elmer) in MEM/10% FCS and incubated for 24 hs at 37° C.,...
US Patent US9422243 (2016)
BindingDB Entry DOI: 10.7270/Q2T72GBH
Human diphtheria toxin-like ADP-ribosyltransferase (ARTD3 or PARP3)
(Homo sapiens (Human))
BDBM240719
(US9422243, 19)
Show SMILES NCCOc1c([nH]c(=O)c2cc(F)ccc12)-c1ccc2OCCOc2c1
Show InChI InChI=1S/C19H17FN2O4/c20-12-2-3-13-14(10-12)19(23)22-17(18(13)26-6-5-21)11-1-4-15-16(9-11)25-8-7-24-15/h1-4,9-10H,5-8,21H2,(H,22,23)
US Patent
n/an/an/a 20n/an/an/an/an/a
NERVIANO MEDICAL SCIENCES S.R.L. a corporation
US Patent
Assay Description
The identification of compounds capable of binding several PARP proteins is carried out through a screening method including the steps of a) provi...
US Patent US9422243 (2016)
BindingDB Entry DOI: 10.7270/Q2T72GBH
Poly [ADP-ribose] polymerase 1
(Homo sapiens (Human))
BDBM240719
(US9422243, 19)
Show SMILES NCCOc1c([nH]c(=O)c2cc(F)ccc12)-c1ccc2OCCOc2c1
Show InChI InChI=1S/C19H17FN2O4/c20-12-2-3-13-14(10-12)19(23)22-17(18(13)26-6-5-21)11-1-4-15-16(9-11)25-8-7-24-15/h1-4,9-10H,5-8,21H2,(H,22,23)
US Patent
n/an/an/a 30n/an/an/an/an/a
NERVIANO MEDICAL SCIENCES S.R.L. a corporation
US Patent
Assay Description
The identification of compounds capable of binding several PARP proteins is carried out through a screening method including the steps of a) provi...
US Patent US9422243 (2016)
BindingDB Entry DOI: 10.7270/Q2T72GBH