BDBM24083 3,5-diaryl-4,5-dihydropyrazole, 9h::N-{4-[3-(2,5-difluorophenyl)-1-(ethylcarbamoyl)-5-phenyl-4,5-dihydro-1H-pyrazol-5-yl]butyl}-1H-imidazole-4-carboxamide
SMILES: CCNC(=O)N1N=C(CC1(CCCCNC(=O)c1cnc[nH]1)c1ccccc1)c1cc(F)ccc1F
InChI Key: InChIKey=RJXBZPLCHUDNKA-UHFFFAOYSA-N
Data: 1 IC50
Activity Spreadsheet -- Enzyme Inhibition Constant Data from BindingDB
Found 1 hit for monomerid = 24083
Trg + Lig
Ki
nM
ΔG°
kcal/mole
IC50
nM
Kd
nM
EC50/IC50
nM
koff
s-1
kon
M-1s-1
pHTemp
°C
A disintegrin and metalloproteinase with thrombospondin motifs 5 (ADAMTS-5)
(Homo sapiens (Human))
BDBM24083
(3,5-diaryl-4,5-dihydropyrazole, 9h | N-{4-[3-(2,5-...)
Show SMILES CCNC(=O)N1N=C(CC1(CCCCNC(=O)c1cnc[nH]1)c1ccccc1)c1cc(F)ccc1F |c:6|
Show InChI InChI=1S/C26H28F2N6O2/c1-2-30-25(36)34-26(18-8-4-3-5-9-18,12-6-7-13-31-24(35)23-16-29-17-32-23)15-22(33-34)20-14-19(27)10-11-21(20)28/h3-5,8-11,14,16-17H,2,6-7,12-13,15H2,1H3,(H,29,32)(H,30,36)(H,31,35)
Reactome pathway
n/an/a 686n/an/an/an/a7.023
Merck Research Laboratories
Assay Description
The kinesin motor domain is incubated with microtubules, 1 mM ATP (1: 1 MgCl2 : Na-ATP), and compound at 23°C in buffer. After reaction was term...
Bioorg Med Chem Lett 16: 3175-9 (2006)
Article DOI: 10.1016/j.bmcl.2006.03.040
BindingDB Entry DOI: 10.7270/Q2445JTH