BDBM24088 3,5-diaryl-4,5-dihydropyrazole, 10e::3-[3-(2,5-difluorophenyl)-1-(morpholin-4-ylcarbonyl)-5-phenyl-4,5-dihydro-1H-pyrazol-5-yl]propan-1-amine
SMILES: NCCCC1(CC(=NN1C(=O)N1CCOCC1)c1cc(F)ccc1F)c1ccccc1
InChI Key: InChIKey=VZEKPRMFWVRUJY-UHFFFAOYSA-N
Data: 1 IC50
Activity Spreadsheet -- Enzyme Inhibition Constant Data from BindingDB
Found 1 hit for monomerid = 24088
Trg + Lig
Ki
nM
ΔG°
kcal/mole
IC50
nM
Kd
nM
EC50/IC50
nM
koff
s-1
kon
M-1s-1
pHTemp
°C
A disintegrin and metalloproteinase with thrombospondin motifs 5 (ADAMTS-5)
(Homo sapiens (Human))
BDBM24088
(3,5-diaryl-4,5-dihydropyrazole, 10e | 3-[3-(2,5-di...)
Show SMILES NCCCC1(CC(=NN1C(=O)N1CCOCC1)c1cc(F)ccc1F)c1ccccc1 |c:6|
Show InChI InChI=1S/C23H26F2N4O2/c24-18-7-8-20(25)19(15-18)21-16-23(9-4-10-26,17-5-2-1-3-6-17)29(27-21)22(30)28-11-13-31-14-12-28/h1-3,5-8,15H,4,9-14,16,26H2
Reactome pathway
n/an/a 122n/an/an/an/a7.023
Merck Research Laboratories
Assay Description
The kinesin motor domain is incubated with microtubules, 1 mM ATP (1: 1 MgCl2 : Na-ATP), and compound at 23°C in buffer. After reaction was term...
Bioorg Med Chem Lett 16: 3175-9 (2006)
Article DOI: 10.1016/j.bmcl.2006.03.040
BindingDB Entry DOI: 10.7270/Q2445JTH