BDBM241320 US10479788, Example 164::US9409907, 164
SMILES: COc1nc(ccc1Nc1ncc2ccnc(NCC(C)(C)OC)c2n1)-c1cn(C)nc1C
InChI Key: InChIKey=KWQUNRNMNBVMKJ-UHFFFAOYSA-N
Data: 2 IC50
Activity Spreadsheet -- Enzyme Inhibition Constant Data from BindingDB
Found 3 hits for monomerid = 241320
Trg + Lig
Ki
nM
ΔG°
kcal/mole
IC50
nM
Kd
nM
EC50/IC50
nM
koff
s-1
kon
M-1s-1
pHTemp
°C
Dual specificity protein kinase TTK
(Homo sapiens (Human))
BDBM241320
(US10479788, Example 164 | US11046688, Example 164 ...)
Show SMILES COc1nc(ccc1Nc1ncc2ccnc(NCC(C)(C)OC)c2n1)-c1cn(C)nc1C
Show InChI InChI=1S/C23H28N8O2/c1-14-16(12-31(4)30-14)17-7-8-18(21(27-17)32-5)28-22-25-11-15-9-10-24-20(19(15)29-22)26-13-23(2,3)33-6/h7-12H,13H2,1-6H3,(H,24,26)(H,25,28,29)
US Patent
n/an/a 3n/an/an/an/a7.025
Cancer Research Technology Limited
US Patent
Assay Description
The enzyme reaction (total volume 10 μl) was carried out in black 384-well low volume plates containing full length MPS1 (12.5 nM or 3 nM), fluo...
US Patent US9409907 (2016)
BindingDB Entry DOI: 10.7270/Q2C24VB2
Dual specificity protein kinase TTK
(Homo sapiens (Human))
BDBM241320
(US10479788, Example 164 | US11046688, Example 164 ...)
Show SMILES COc1nc(ccc1Nc1ncc2ccnc(NCC(C)(C)OC)c2n1)-c1cn(C)nc1C
Show InChI InChI=1S/C23H28N8O2/c1-14-16(12-31(4)30-14)17-7-8-18(21(27-17)32-5)28-22-25-11-15-9-10-24-20(19(15)29-22)26-13-23(2,3)33-6/h7-12H,13H2,1-6H3,(H,24,26)(H,25,28,29)
n/an/a 3n/an/an/an/an/an/a
TBA
Citation and Details
Dual specificity protein kinase TTK
(Homo sapiens (Human))
BDBM241320
(US10479788, Example 164 | US11046688, Example 164 ...)
Show SMILES COc1nc(ccc1Nc1ncc2ccnc(NCC(C)(C)OC)c2n1)-c1cn(C)nc1C
Show InChI InChI=1S/C23H28N8O2/c1-14-16(12-31(4)30-14)17-7-8-18(21(27-17)32-5)28-22-25-11-15-9-10-24-20(19(15)29-22)26-13-23(2,3)33-6/h7-12H,13H2,1-6H3,(H,24,26)(H,25,28,29)
US Patent
n/an/a 3n/an/an/an/an/an/a
Cancer Research Technology Limited
US Patent
Assay Description
The enzyme reaction (total volume 10 μl) was carried out in black 384-well low volume plates containing full length MPS1 (12.5 nM or 3 nM), fluo...
US Patent US10479788 (2019)
BindingDB Entry DOI: 10.7270/Q2BP055X